Test results
6 suites, 7 failed tests
at.ac.testing.brooklyn.equivalent.AutoScalerPolicyTest
testResizeDownStabilizationDelayTakesMinSustainedDesired
"java.lang.AssertionError: expected [1] but found [2] at at.ac.testing.brooklyn.equivalent.AutoScalerPolicyTest$7.run(AutoScalerPolicyTest.java:617) at java_lang_Runnable$run.call(Unknown Source) at brooklyn.test.TestUtils$_executeUntilSucceeds_closure5.doCall(TestUtils.groovy:148) at groovy.lang.MetaMethod.doMethodInvoke(MetaMethod.java:233) at org.codehaus.groovy.runtime.metaclass.ClosureMetaClass.invokeMethod(ClosureMetaClass.java:272) at groovy.lang.MetaClassImpl.invokeMethod(MetaClassImpl.java:877) at org.codehaus.groovy.runtime.callsite.PogoMetaClassSite.callCurrent(PogoMetaClassSite.java:66) at org.codehaus.groovy.runtime.callsite.AbstractCallSite.callCurrent(AbstractCallSite.java:141) at brooklyn.test.TestUtils$_executeUntilSucceeds_closure5.doCall(TestUtils.groovy) at groovy.lang.MetaMethod.doMethodInvoke(MetaMethod.java:233) at org.codehaus.groovy.runtime.metaclass.ClosureMetaClass.invokeMethod(ClosureMetaClass.java:272) at groovy.lang.MetaClassImpl.invokeMethod(MetaClassImpl.java:877) at org.codehaus.groovy.runtime.callsite.PogoMetaClassSite.call(PogoMetaClassSite.java:39) at org.codehaus.groovy.runtime.callsite.AbstractCallSite.call(AbstractCallSite.java:112) at brooklyn.test.TestUtils.executeUntilSucceedsWithFinallyBlockInternal(TestUtils.groovy:243) at org.codehaus.groovy.runtime.callsite.StaticMetaMethodSite$StaticMetaMethodSiteNoUnwrapNoCoerce.invoke(StaticMetaMethodSite.java:148) at org.codehaus.groovy.runtime.callsite.StaticMetaMethodSite.callStatic(StaticMetaMethodSite.java:99) at org.codehaus.groovy.runtime.callsite.AbstractCallSite.callStatic(AbstractCallSite.java:173) at brooklyn.test.TestUtils.executeUntilSucceedsWithFinallyBlock(TestUtils.groovy:208) at brooklyn.test.TestUtils$executeUntilSucceedsWithFinallyBlock.callStatic(Unknown Source) at brooklyn.test.TestUtils.executeUntilSucceeds(TestUtils.groovy:148) at at.ac.testing.brooklyn.equivalent.AutoScalerPolicyTest.testResizeDownStabilizationDelayTakesMinSustainedDesired(AutoScalerPolicyTest.java:538) at org.apache.maven.surefire.testng.TestNGExecutor.run(TestNGExecutor.java:178) at org.apache.maven.surefire.testng.TestNGXmlTestSuite.execute(TestNGXmlTestSuite.java:92) at org.apache.maven.surefire.testng.TestNGProvider.invoke(TestNGProvider.java:96) at org.apache.maven.surefire.util.ReflectionUtils.invokeMethodWithArray2(ReflectionUtils.java:208) at org.apache.maven.surefire.booter.ProviderFactory$ProviderProxy.invoke(ProviderFactory.java:158) at org.apache.maven.surefire.booter.ProviderFactory.invokeProvider(ProviderFactory.java:86) at org.apache.maven.surefire.booter.ForkedBooter.runSuitesInProcess(ForkedBooter.java:153) at org.apache.maven.surefire.booter.ForkedBooter.main(ForkedBooter.java:95) ... Removed 42 stack frames
java.lang.AssertionError: expected [1] but found [2] at org.testng.Assert.fail(Assert.java:94) at org.testng.Assert.failNotEquals(Assert.java:494) at org.testng.Assert.assertEquals(Assert.java:123) at org.testng.Assert.assertEquals(Assert.java:165) at at.ac.testing.brooklyn.equivalent.AutoScalerPolicyTest$7.run(AutoScalerPolicyTest.java:617) at java_lang_Runnable$run.call(Unknown Source) at brooklyn.test.TestUtils$_executeUntilSucceeds_closure5.doCall(TestUtils.groovy:148) at sun.reflect.GeneratedMethodAccessor6.invoke(Unknown Source) at sun.reflect.DelegatingMethodAccessorImpl.invoke(DelegatingMethodAccessorImpl.java:43) at java.lang.reflect.Method.invoke(Method.java:606) at org.codehaus.groovy.reflection.CachedMethod.invoke(CachedMethod.java:90) at groovy.lang.MetaMethod.doMethodInvoke(MetaMethod.java:233) at org.codehaus.groovy.runtime.metaclass.ClosureMetaClass.invokeMethod(ClosureMetaClass.java:272) at groovy.lang.MetaClassImpl.invokeMethod(MetaClassImpl.java:877) at org.codehaus.groovy.runtime.callsite.PogoMetaClassSite.callCurrent(PogoMetaClassSite.java:66) at org.codehaus.groovy.runtime.callsite.AbstractCallSite.callCurrent(AbstractCallSite.java:141) at brooklyn.test.TestUtils$_executeUntilSucceeds_closure5.doCall(TestUtils.groovy) at sun.reflect.GeneratedMethodAccessor5.invoke(Unknown Source) at sun.reflect.DelegatingMethodAccessorImpl.invoke(DelegatingMethodAccessorImpl.java:43) at java.lang.reflect.Method.invoke(Method.java:606) at org.codehaus.groovy.reflection.CachedMethod.invoke(CachedMethod.java:90) at groovy.lang.MetaMethod.doMethodInvoke(MetaMethod.java:233) at org.codehaus.groovy.runtime.metaclass.ClosureMetaClass.invokeMethod(ClosureMetaClass.java:272) at groovy.lang.MetaClassImpl.invokeMethod(MetaClassImpl.java:877) at org.codehaus.groovy.runtime.callsite.PogoMetaClassSite.call(PogoMetaClassSite.java:39) at org.codehaus.groovy.runtime.callsite.AbstractCallSite.call(AbstractCallSite.java:112) at brooklyn.test.TestUtils.executeUntilSucceedsWithFinallyBlockInternal(TestUtils.groovy:243) at sun.reflect.GeneratedMethodAccessor35.invoke(Unknown Source) at sun.reflect.DelegatingMethodAccessorImpl.invoke(DelegatingMethodAccessorImpl.java:43) at java.lang.reflect.Method.invoke(Method.java:606) at org.codehaus.groovy.reflection.CachedMethod.invoke(CachedMethod.java:90) at org.codehaus.groovy.runtime.callsite.StaticMetaMethodSite$StaticMetaMethodSiteNoUnwrapNoCoerce.invoke(StaticMetaMethodSite.java:148) at org.codehaus.groovy.runtime.callsite.StaticMetaMethodSite.callStatic(StaticMetaMethodSite.java:99) at org.codehaus.groovy.runtime.callsite.AbstractCallSite.callStatic(AbstractCallSite.java:173) at brooklyn.test.TestUtils.executeUntilSucceedsWithFinallyBlock(TestUtils.groovy:208) at brooklyn.test.TestUtils$executeUntilSucceedsWithFinallyBlock.callStatic(Unknown Source) at brooklyn.test.TestUtils.executeUntilSucceeds(TestUtils.groovy:148) at at.ac.testing.brooklyn.equivalent.AutoScalerPolicyTest.testResizeDownStabilizationDelayTakesMinSustainedDesired(AutoScalerPolicyTest.java:538) at sun.reflect.NativeMethodAccessorImpl.invoke0(Native Method) at sun.reflect.NativeMethodAccessorImpl.invoke(NativeMethodAccessorImpl.java:57) at sun.reflect.DelegatingMethodAccessorImpl.invoke(DelegatingMethodAccessorImpl.java:43) at java.lang.reflect.Method.invoke(Method.java:606) at org.testng.internal.MethodInvocationHelper.invokeMethod(MethodInvocationHelper.java:80) at org.testng.internal.Invoker.invokeMethod(Invoker.java:714) at org.testng.internal.Invoker.invokeTestMethod(Invoker.java:901) at org.testng.internal.Invoker.invokeTestMethods(Invoker.java:1231) at org.testng.internal.TestMethodWorker.invokeTestMethods(TestMethodWorker.java:127) at org.testng.internal.TestMethodWorker.run(TestMethodWorker.java:111) at org.testng.TestRunner.privateRun(TestRunner.java:767) at org.testng.TestRunner.run(TestRunner.java:617) at org.testng.SuiteRunner.runTest(SuiteRunner.java:334) at org.testng.SuiteRunner.runSequentially(SuiteRunner.java:329) at org.testng.SuiteRunner.privateRun(SuiteRunner.java:291) at org.testng.SuiteRunner.run(SuiteRunner.java:240) at org.testng.SuiteRunnerWorker.runSuite(SuiteRunnerWorker.java:52) at org.testng.SuiteRunnerWorker.run(SuiteRunnerWorker.java:86) at org.testng.TestNG.runSuitesSequentially(TestNG.java:1198) at org.testng.TestNG.runSuitesSequentially(TestNG.java:1194) at org.testng.TestNG.runSuitesLocally(TestNG.java:1123) at org.testng.TestNG.run(TestNG.java:1031) at org.apache.maven.surefire.testng.TestNGExecutor.run(TestNGExecutor.java:178) at org.apache.maven.surefire.testng.TestNGXmlTestSuite.execute(TestNGXmlTestSuite.java:92) at org.apache.maven.surefire.testng.TestNGProvider.invoke(TestNGProvider.java:96) at sun.reflect.NativeMethodAccessorImpl.invoke0(Native Method) at sun.reflect.NativeMethodAccessorImpl.invoke(NativeMethodAccessorImpl.java:57) at sun.reflect.DelegatingMethodAccessorImpl.invoke(DelegatingMethodAccessorImpl.java:43) at java.lang.reflect.Method.invoke(Method.java:606) at org.apache.maven.surefire.util.ReflectionUtils.invokeMethodWithArray2(ReflectionUtils.java:208) at org.apache.maven.surefire.booter.ProviderFactory$ProviderProxy.invoke(ProviderFactory.java:158) at org.apache.maven.surefire.booter.ProviderFactory.invokeProvider(ProviderFactory.java:86) at org.apache.maven.surefire.booter.ForkedBooter.runSuitesInProcess(ForkedBooter.java:153) at org.apache.maven.surefire.booter.ForkedBooter.main(ForkedBooter.java:95) "

org.testng.Assert.fail(Assert.java:94)
org.testng.Assert.failNotEquals(Assert.java:494)
org.testng.Assert.assertEquals(Assert.java:123)
org.testng.Assert.assertEquals(Assert.java:165)
at.ac.testing.brooklyn.equivalent.AutoScalerPolicyTest$7.run(AutoScalerPolicyTest.java:617)
java_lang_Runnable$run.call(Unknown Source)
brooklyn.test.TestUtils$_executeUntilSucceeds_closure5.doCall(TestUtils.groovy:148)
sun.reflect.GeneratedMethodAccessor6.invoke(Unknown Source)
sun.reflect.DelegatingMethodAccessorImpl.invoke(DelegatingMethodAccessorImpl.java:43)
java.lang.reflect.Method.invoke(Method.java:606)
org.codehaus.groovy.reflection.CachedMethod.invoke(CachedMethod.java:90)
groovy.lang.MetaMethod.doMethodInvoke(MetaMethod.java:233)
org.codehaus.groovy.runtime.metaclass.ClosureMetaClass.invokeMethod(ClosureMetaClass.java:272)
groovy.lang.MetaClassImpl.invokeMethod(MetaClassImpl.java:877)
org.codehaus.groovy.runtime.callsite.PogoMetaClassSite.callCurrent(PogoMetaClassSite.java:66)
org.codehaus.groovy.runtime.callsite.AbstractCallSite.callCurrent(AbstractCallSite.java:141)
brooklyn.test.TestUtils$_executeUntilSucceeds_closure5.doCall(TestUtils.groovy)
sun.reflect.GeneratedMethodAccessor5.invoke(Unknown Source)
sun.reflect.DelegatingMethodAccessorImpl.invoke(DelegatingMethodAccessorImpl.java:43)
java.lang.reflect.Method.invoke(Method.java:606)
org.codehaus.groovy.reflection.CachedMethod.invoke(CachedMethod.java:90)
groovy.lang.MetaMethod.doMethodInvoke(MetaMethod.java:233)
org.codehaus.groovy.runtime.metaclass.ClosureMetaClass.invokeMethod(ClosureMetaClass.java:272)
groovy.lang.MetaClassImpl.invokeMethod(MetaClassImpl.java:877)
org.codehaus.groovy.runtime.callsite.PogoMetaClassSite.call(PogoMetaClassSite.java:39)
org.codehaus.groovy.runtime.callsite.AbstractCallSite.call(AbstractCallSite.java:112)
brooklyn.test.TestUtils.executeUntilSucceedsWithFinallyBlockInternal(TestUtils.groovy:243)
sun.reflect.GeneratedMethodAccessor35.invoke(Unknown Source)
sun.reflect.DelegatingMethodAccessorImpl.invoke(DelegatingMethodAccessorImpl.java:43)
java.lang.reflect.Method.invoke(Method.java:606)
org.codehaus.groovy.reflection.CachedMethod.invoke(CachedMethod.java:90)
org.codehaus.groovy.runtime.callsite.StaticMetaMethodSite$StaticMetaMethodSiteNoUnwrapNoCoerce.invoke(StaticMetaMethodSite.java:148)
org.codehaus.groovy.runtime.callsite.StaticMetaMethodSite.callStatic(StaticMetaMethodSite.java:99)
org.codehaus.groovy.runtime.callsite.AbstractCallSite.callStatic(AbstractCallSite.java:173)
brooklyn.test.TestUtils.executeUntilSucceedsWithFinallyBlock(TestUtils.groovy:208)
brooklyn.test.TestUtils$executeUntilSucceedsWithFinallyBlock.callStatic(Unknown Source)
brooklyn.test.TestUtils.executeUntilSucceeds(TestUtils.groovy:148)
at.ac.testing.brooklyn.equivalent.AutoScalerPolicyTest.testResizeDownStabilizationDelayTakesMinSustainedDesired(AutoScalerPolicyTest.java:538)
sun.reflect.NativeMethodAccessorImpl.invoke0(Native Method)
sun.reflect.NativeMethodAccessorImpl.invoke(NativeMethodAccessorImpl.java:57)
sun.reflect.DelegatingMethodAccessorImpl.invoke(DelegatingMethodAccessorImpl.java:43)
java.lang.reflect.Method.invoke(Method.java:606)
org.testng.internal.MethodInvocationHelper.invokeMethod(MethodInvocationHelper.java:80)
org.testng.internal.Invoker.invokeMethod(Invoker.java:714)
org.testng.internal.Invoker.invokeTestMethod(Invoker.java:901)
org.testng.internal.Invoker.invokeTestMethods(Invoker.java:1231)
org.testng.internal.TestMethodWorker.invokeTestMethods(TestMethodWorker.java:127)
org.testng.internal.TestMethodWorker.run(TestMethodWorker.java:111)
org.testng.TestRunner.privateRun(TestRunner.java:767)
org.testng.TestRunner.run(TestRunner.java:617)
org.testng.SuiteRunner.runTest(SuiteRunner.java:334)
org.testng.SuiteRunner.runSequentially(SuiteRunner.java:329)
org.testng.SuiteRunner.privateRun(SuiteRunner.java:291)
org.testng.SuiteRunner.run(SuiteRunner.java:240)
org.testng.SuiteRunnerWorker.runSuite(SuiteRunnerWorker.java:52)
org.testng.SuiteRunnerWorker.run(SuiteRunnerWorker.java:86)
org.testng.TestNG.runSuitesSequentially(TestNG.java:1198)
org.testng.TestNG.runSuitesSequentially(TestNG.java:1194)
org.testng.TestNG.runSuitesLocally(TestNG.java:1123)
org.testng.TestNG.run(TestNG.java:1031)
org.apache.maven.surefire.testng.TestNGExecutor.run(TestNGExecutor.java:178)
org.apache.maven.surefire.testng.TestNGXmlTestSuite.execute(TestNGXmlTestSuite.java:92)
org.apache.maven.surefire.testng.TestNGProvider.invoke(TestNGProvider.java:96)
sun.reflect.NativeMethodAccessorImpl.invoke0(Native Method)
sun.reflect.NativeMethodAccessorImpl.invoke(NativeMethodAccessorImpl.java:57)
sun.reflect.DelegatingMethodAccessorImpl.invoke(DelegatingMethodAccessorImpl.java:43)
java.lang.reflect.Method.invoke(Method.java:606)
org.apache.maven.surefire.util.ReflectionUtils.invokeMethodWithArray2(ReflectionUtils.java:208)
org.apache.maven.surefire.booter.ProviderFactory$ProviderProxy.invoke(ProviderFactory.java:158)
org.apache.maven.surefire.booter.ProviderFactory.invokeProvider(ProviderFactory.java:86)
org.apache.maven.surefire.booter.ForkedBooter.runSuitesInProcess(ForkedBooter.java:153)
org.apache.maven.surefire.booter.ForkedBooter.main(ForkedBooter.java:95)
at.ac.testing.brooklyn.equivalent.AutoScalerPolicyMetricTest
testDecrementsSizeIffLowerBoundExceeded
testDecrementsSizeInProportionToMetric
testIncrementsSizeIffUpperBoundExceeded
testIncrementsSizeInProportionToMetric
testObeysMinAndMaxSize
testWarnsWhenMaxCapReached
at.ac.testing.brooklyn.equivalent.AutoScalerPolicyTest
testConcurrentGrowGrow
testConcurrentGrowShrink
testConcurrentShrinkGrow
testConcurrentShrinkShrink
testGrowHotPool
testNeverGrowAboveMaximmum
testNeverGrowColdPool
testNeverShrinkBelowMinimum
testNeverShrinkHotPool
testResizeDownStabilizationDelayIgnoresBlip
testResizeDownStabilizationDelayResizesAfterDelay
testResizeUpStabilizationDelayIgnoresBlip
testResizeUpStabilizationDelayResizesAfterDelay
testResizeUpStabilizationDelayTakesMaxSustainedDesired
testShrinkColdPool
testShrinkColdPoolRoundsUpDesiredNumberOfContainers
at.ac.testing.brooklyn.scenario.AutoScalerPolicyTest
testResizeDownStabilizationDelayTakesMinSustainedDesired
"java.lang.AssertionError: expected [1] but found [2] at at.ac.testing.brooklyn.original.AutoScalerPolicyTest$7.run(AutoScalerPolicyTest.java:608) at java_lang_Runnable$run.call(Unknown Source) at brooklyn.test.TestUtils$_executeUntilSucceeds_closure5.doCall(TestUtils.groovy:148) at groovy.lang.MetaMethod.doMethodInvoke(MetaMethod.java:233) at org.codehaus.groovy.runtime.metaclass.ClosureMetaClass.invokeMethod(ClosureMetaClass.java:272) at groovy.lang.MetaClassImpl.invokeMethod(MetaClassImpl.java:877) at org.codehaus.groovy.runtime.callsite.PogoMetaClassSite.callCurrent(PogoMetaClassSite.java:66) at org.codehaus.groovy.runtime.callsite.AbstractCallSite.callCurrent(AbstractCallSite.java:141) at brooklyn.test.TestUtils$_executeUntilSucceeds_closure5.doCall(TestUtils.groovy) at groovy.lang.MetaMethod.doMethodInvoke(MetaMethod.java:233) at org.codehaus.groovy.runtime.metaclass.ClosureMetaClass.invokeMethod(ClosureMetaClass.java:272) at groovy.lang.MetaClassImpl.invokeMethod(MetaClassImpl.java:877) at org.codehaus.groovy.runtime.callsite.PogoMetaClassSite.call(PogoMetaClassSite.java:39) at org.codehaus.groovy.runtime.callsite.AbstractCallSite.call(AbstractCallSite.java:112) at brooklyn.test.TestUtils.executeUntilSucceedsWithFinallyBlockInternal(TestUtils.groovy:243) at org.codehaus.groovy.runtime.callsite.StaticMetaMethodSite$StaticMetaMethodSiteNoUnwrapNoCoerce.invoke(StaticMetaMethodSite.java:148) at org.codehaus.groovy.runtime.callsite.StaticMetaMethodSite.callStatic(StaticMetaMethodSite.java:99) at org.codehaus.groovy.runtime.callsite.AbstractCallSite.callStatic(AbstractCallSite.java:173) at brooklyn.test.TestUtils.executeUntilSucceedsWithFinallyBlock(TestUtils.groovy:208) at brooklyn.test.TestUtils$executeUntilSucceedsWithFinallyBlock.callStatic(Unknown Source) at brooklyn.test.TestUtils.executeUntilSucceeds(TestUtils.groovy:148) at at.ac.testing.brooklyn.scenario.AutoScalerPolicyTest.testResizeDownStabilizationDelayTakesMinSustainedDesired(AutoScalerPolicyTest.java:647) at org.apache.maven.surefire.testng.TestNGExecutor.run(TestNGExecutor.java:178) at org.apache.maven.surefire.testng.TestNGXmlTestSuite.execute(TestNGXmlTestSuite.java:92) at org.apache.maven.surefire.testng.TestNGProvider.invoke(TestNGProvider.java:96) at org.apache.maven.surefire.util.ReflectionUtils.invokeMethodWithArray2(ReflectionUtils.java:208) at org.apache.maven.surefire.booter.ProviderFactory$ProviderProxy.invoke(ProviderFactory.java:158) at org.apache.maven.surefire.booter.ProviderFactory.invokeProvider(ProviderFactory.java:86) at org.apache.maven.surefire.booter.ForkedBooter.runSuitesInProcess(ForkedBooter.java:153) at org.apache.maven.surefire.booter.ForkedBooter.main(ForkedBooter.java:95) ... Removed 42 stack frames
java.lang.AssertionError: expected [1] but found [2] at org.testng.Assert.fail(Assert.java:94) at org.testng.Assert.failNotEquals(Assert.java:494) at org.testng.Assert.assertEquals(Assert.java:123) at org.testng.Assert.assertEquals(Assert.java:165) at at.ac.testing.brooklyn.original.AutoScalerPolicyTest$7.run(AutoScalerPolicyTest.java:608) at java_lang_Runnable$run.call(Unknown Source) at brooklyn.test.TestUtils$_executeUntilSucceeds_closure5.doCall(TestUtils.groovy:148) at sun.reflect.GeneratedMethodAccessor6.invoke(Unknown Source) at sun.reflect.DelegatingMethodAccessorImpl.invoke(DelegatingMethodAccessorImpl.java:43) at java.lang.reflect.Method.invoke(Method.java:606) at org.codehaus.groovy.reflection.CachedMethod.invoke(CachedMethod.java:90) at groovy.lang.MetaMethod.doMethodInvoke(MetaMethod.java:233) at org.codehaus.groovy.runtime.metaclass.ClosureMetaClass.invokeMethod(ClosureMetaClass.java:272) at groovy.lang.MetaClassImpl.invokeMethod(MetaClassImpl.java:877) at org.codehaus.groovy.runtime.callsite.PogoMetaClassSite.callCurrent(PogoMetaClassSite.java:66) at org.codehaus.groovy.runtime.callsite.AbstractCallSite.callCurrent(AbstractCallSite.java:141) at brooklyn.test.TestUtils$_executeUntilSucceeds_closure5.doCall(TestUtils.groovy) at sun.reflect.GeneratedMethodAccessor5.invoke(Unknown Source) at sun.reflect.DelegatingMethodAccessorImpl.invoke(DelegatingMethodAccessorImpl.java:43) at java.lang.reflect.Method.invoke(Method.java:606) at org.codehaus.groovy.reflection.CachedMethod.invoke(CachedMethod.java:90) at groovy.lang.MetaMethod.doMethodInvoke(MetaMethod.java:233) at org.codehaus.groovy.runtime.metaclass.ClosureMetaClass.invokeMethod(ClosureMetaClass.java:272) at groovy.lang.MetaClassImpl.invokeMethod(MetaClassImpl.java:877) at org.codehaus.groovy.runtime.callsite.PogoMetaClassSite.call(PogoMetaClassSite.java:39) at org.codehaus.groovy.runtime.callsite.AbstractCallSite.call(AbstractCallSite.java:112) at brooklyn.test.TestUtils.executeUntilSucceedsWithFinallyBlockInternal(TestUtils.groovy:243) at sun.reflect.GeneratedMethodAccessor35.invoke(Unknown Source) at sun.reflect.DelegatingMethodAccessorImpl.invoke(DelegatingMethodAccessorImpl.java:43) at java.lang.reflect.Method.invoke(Method.java:606) at org.codehaus.groovy.reflection.CachedMethod.invoke(CachedMethod.java:90) at org.codehaus.groovy.runtime.callsite.StaticMetaMethodSite$StaticMetaMethodSiteNoUnwrapNoCoerce.invoke(StaticMetaMethodSite.java:148) at org.codehaus.groovy.runtime.callsite.StaticMetaMethodSite.callStatic(StaticMetaMethodSite.java:99) at org.codehaus.groovy.runtime.callsite.AbstractCallSite.callStatic(AbstractCallSite.java:173) at brooklyn.test.TestUtils.executeUntilSucceedsWithFinallyBlock(TestUtils.groovy:208) at brooklyn.test.TestUtils$executeUntilSucceedsWithFinallyBlock.callStatic(Unknown Source) at brooklyn.test.TestUtils.executeUntilSucceeds(TestUtils.groovy:148) at at.ac.testing.brooklyn.scenario.AutoScalerPolicyTest.testResizeDownStabilizationDelayTakesMinSustainedDesired(AutoScalerPolicyTest.java:647) at sun.reflect.NativeMethodAccessorImpl.invoke0(Native Method) at sun.reflect.NativeMethodAccessorImpl.invoke(NativeMethodAccessorImpl.java:57) at sun.reflect.DelegatingMethodAccessorImpl.invoke(DelegatingMethodAccessorImpl.java:43) at java.lang.reflect.Method.invoke(Method.java:606) at org.testng.internal.MethodInvocationHelper.invokeMethod(MethodInvocationHelper.java:80) at org.testng.internal.Invoker.invokeMethod(Invoker.java:714) at org.testng.internal.Invoker.invokeTestMethod(Invoker.java:901) at org.testng.internal.Invoker.invokeTestMethods(Invoker.java:1231) at org.testng.internal.TestMethodWorker.invokeTestMethods(TestMethodWorker.java:127) at org.testng.internal.TestMethodWorker.run(TestMethodWorker.java:111) at org.testng.TestRunner.privateRun(TestRunner.java:767) at org.testng.TestRunner.run(TestRunner.java:617) at org.testng.SuiteRunner.runTest(SuiteRunner.java:334) at org.testng.SuiteRunner.runSequentially(SuiteRunner.java:329) at org.testng.SuiteRunner.privateRun(SuiteRunner.java:291) at org.testng.SuiteRunner.run(SuiteRunner.java:240) at org.testng.SuiteRunnerWorker.runSuite(SuiteRunnerWorker.java:52) at org.testng.SuiteRunnerWorker.run(SuiteRunnerWorker.java:86) at org.testng.TestNG.runSuitesSequentially(TestNG.java:1198) at org.testng.TestNG.runSuitesSequentially(TestNG.java:1194) at org.testng.TestNG.runSuitesLocally(TestNG.java:1123) at org.testng.TestNG.run(TestNG.java:1031) at org.apache.maven.surefire.testng.TestNGExecutor.run(TestNGExecutor.java:178) at org.apache.maven.surefire.testng.TestNGXmlTestSuite.execute(TestNGXmlTestSuite.java:92) at org.apache.maven.surefire.testng.TestNGProvider.invoke(TestNGProvider.java:96) at sun.reflect.NativeMethodAccessorImpl.invoke0(Native Method) at sun.reflect.NativeMethodAccessorImpl.invoke(NativeMethodAccessorImpl.java:57) at sun.reflect.DelegatingMethodAccessorImpl.invoke(DelegatingMethodAccessorImpl.java:43) at java.lang.reflect.Method.invoke(Method.java:606) at org.apache.maven.surefire.util.ReflectionUtils.invokeMethodWithArray2(ReflectionUtils.java:208) at org.apache.maven.surefire.booter.ProviderFactory$ProviderProxy.invoke(ProviderFactory.java:158) at org.apache.maven.surefire.booter.ProviderFactory.invokeProvider(ProviderFactory.java:86) at org.apache.maven.surefire.booter.ForkedBooter.runSuitesInProcess(ForkedBooter.java:153) at org.apache.maven.surefire.booter.ForkedBooter.main(ForkedBooter.java:95) "

org.testng.Assert.fail(Assert.java:94)
org.testng.Assert.failNotEquals(Assert.java:494)
org.testng.Assert.assertEquals(Assert.java:123)
org.testng.Assert.assertEquals(Assert.java:165)
at.ac.testing.brooklyn.original.AutoScalerPolicyTest$7.run(AutoScalerPolicyTest.java:608)
java_lang_Runnable$run.call(Unknown Source)
brooklyn.test.TestUtils$_executeUntilSucceeds_closure5.doCall(TestUtils.groovy:148)
sun.reflect.GeneratedMethodAccessor6.invoke(Unknown Source)
sun.reflect.DelegatingMethodAccessorImpl.invoke(DelegatingMethodAccessorImpl.java:43)
java.lang.reflect.Method.invoke(Method.java:606)
org.codehaus.groovy.reflection.CachedMethod.invoke(CachedMethod.java:90)
groovy.lang.MetaMethod.doMethodInvoke(MetaMethod.java:233)
org.codehaus.groovy.runtime.metaclass.ClosureMetaClass.invokeMethod(ClosureMetaClass.java:272)
groovy.lang.MetaClassImpl.invokeMethod(MetaClassImpl.java:877)
org.codehaus.groovy.runtime.callsite.PogoMetaClassSite.callCurrent(PogoMetaClassSite.java:66)
org.codehaus.groovy.runtime.callsite.AbstractCallSite.callCurrent(AbstractCallSite.java:141)
brooklyn.test.TestUtils$_executeUntilSucceeds_closure5.doCall(TestUtils.groovy)
sun.reflect.GeneratedMethodAccessor5.invoke(Unknown Source)
sun.reflect.DelegatingMethodAccessorImpl.invoke(DelegatingMethodAccessorImpl.java:43)
java.lang.reflect.Method.invoke(Method.java:606)
org.codehaus.groovy.reflection.CachedMethod.invoke(CachedMethod.java:90)
groovy.lang.MetaMethod.doMethodInvoke(MetaMethod.java:233)
org.codehaus.groovy.runtime.metaclass.ClosureMetaClass.invokeMethod(ClosureMetaClass.java:272)
groovy.lang.MetaClassImpl.invokeMethod(MetaClassImpl.java:877)
org.codehaus.groovy.runtime.callsite.PogoMetaClassSite.call(PogoMetaClassSite.java:39)
org.codehaus.groovy.runtime.callsite.AbstractCallSite.call(AbstractCallSite.java:112)
brooklyn.test.TestUtils.executeUntilSucceedsWithFinallyBlockInternal(TestUtils.groovy:243)
sun.reflect.GeneratedMethodAccessor35.invoke(Unknown Source)
sun.reflect.DelegatingMethodAccessorImpl.invoke(DelegatingMethodAccessorImpl.java:43)
java.lang.reflect.Method.invoke(Method.java:606)
org.codehaus.groovy.reflection.CachedMethod.invoke(CachedMethod.java:90)
org.codehaus.groovy.runtime.callsite.StaticMetaMethodSite$StaticMetaMethodSiteNoUnwrapNoCoerce.invoke(StaticMetaMethodSite.java:148)
org.codehaus.groovy.runtime.callsite.StaticMetaMethodSite.callStatic(StaticMetaMethodSite.java:99)
org.codehaus.groovy.runtime.callsite.AbstractCallSite.callStatic(AbstractCallSite.java:173)
brooklyn.test.TestUtils.executeUntilSucceedsWithFinallyBlock(TestUtils.groovy:208)
brooklyn.test.TestUtils$executeUntilSucceedsWithFinallyBlock.callStatic(Unknown Source)
brooklyn.test.TestUtils.executeUntilSucceeds(TestUtils.groovy:148)
at.ac.testing.brooklyn.scenario.AutoScalerPolicyTest.testResizeDownStabilizationDelayTakesMinSustainedDesired(AutoScalerPolicyTest.java:647)
sun.reflect.NativeMethodAccessorImpl.invoke0(Native Method)
sun.reflect.NativeMethodAccessorImpl.invoke(NativeMethodAccessorImpl.java:57)
sun.reflect.DelegatingMethodAccessorImpl.invoke(DelegatingMethodAccessorImpl.java:43)
java.lang.reflect.Method.invoke(Method.java:606)
org.testng.internal.MethodInvocationHelper.invokeMethod(MethodInvocationHelper.java:80)
org.testng.internal.Invoker.invokeMethod(Invoker.java:714)
org.testng.internal.Invoker.invokeTestMethod(Invoker.java:901)
org.testng.internal.Invoker.invokeTestMethods(Invoker.java:1231)
org.testng.internal.TestMethodWorker.invokeTestMethods(TestMethodWorker.java:127)
org.testng.internal.TestMethodWorker.run(TestMethodWorker.java:111)
org.testng.TestRunner.privateRun(TestRunner.java:767)
org.testng.TestRunner.run(TestRunner.java:617)
org.testng.SuiteRunner.runTest(SuiteRunner.java:334)
org.testng.SuiteRunner.runSequentially(SuiteRunner.java:329)
org.testng.SuiteRunner.privateRun(SuiteRunner.java:291)
org.testng.SuiteRunner.run(SuiteRunner.java:240)
org.testng.SuiteRunnerWorker.runSuite(SuiteRunnerWorker.java:52)
org.testng.SuiteRunnerWorker.run(SuiteRunnerWorker.java:86)
org.testng.TestNG.runSuitesSequentially(TestNG.java:1198)
org.testng.TestNG.runSuitesSequentially(TestNG.java:1194)
org.testng.TestNG.runSuitesLocally(TestNG.java:1123)
org.testng.TestNG.run(TestNG.java:1031)
org.apache.maven.surefire.testng.TestNGExecutor.run(TestNGExecutor.java:178)
org.apache.maven.surefire.testng.TestNGXmlTestSuite.execute(TestNGXmlTestSuite.java:92)
org.apache.maven.surefire.testng.TestNGProvider.invoke(TestNGProvider.java:96)
sun.reflect.NativeMethodAccessorImpl.invoke0(Native Method)
sun.reflect.NativeMethodAccessorImpl.invoke(NativeMethodAccessorImpl.java:57)
sun.reflect.DelegatingMethodAccessorImpl.invoke(DelegatingMethodAccessorImpl.java:43)
java.lang.reflect.Method.invoke(Method.java:606)
org.apache.maven.surefire.util.ReflectionUtils.invokeMethodWithArray2(ReflectionUtils.java:208)
org.apache.maven.surefire.booter.ProviderFactory$ProviderProxy.invoke(ProviderFactory.java:158)
org.apache.maven.surefire.booter.ProviderFactory.invokeProvider(ProviderFactory.java:86)
org.apache.maven.surefire.booter.ForkedBooter.runSuitesInProcess(ForkedBooter.java:153)
org.apache.maven.surefire.booter.ForkedBooter.main(ForkedBooter.java:95)
at.ac.testing.brooklyn.scenario.AutoScalerPolicyTest
testConcurrentGrowGrow
testConcurrentGrowShrink
testConcurrentShrinkGrow
testConcurrentShrinkShrink
testGrowHotPool
testNeverGrowAboveMaximmum
testNeverGrowColdPool
testNeverShrinkBelowMinimum
testNeverShrinkHotPool
testResizeDownStabilizationDelayIgnoresBlip
testResizeDownStabilizationDelayResizesAfterDelay
testResizeUpStabilizationDelayIgnoresBlip
testResizeUpStabilizationDelayResizesAfterDelay
testResizeUpStabilizationDelayTakesMaxSustainedDesired
testShrinkColdPool
testShrinkColdPoolRoundsUpDesiredNumberOfContainers
at.ac.testing.brooklyn.scenario.AutoScalerPolicyMetricTest
testDecrementsSizeIffLowerBoundExceeded
testDecrementsSizeInProportionToMetric
testIncrementsSizeIffUpperBoundExceeded
testIncrementsSizeInProportionToMetric
testObeysMinAndMaxSize
testWarnsWhenMaxCapReached
at.ac.testing.brooklyn.literal.AutoScalerPolicyTest
testResizeDownStabilizationDelayIgnoresBlip
"java.lang.AssertionError: expected [2] but found [1] at at.ac.testing.brooklyn.literal.AutoScalerPolicyTest.testResizeDownStabilizationDelayIgnoresBlip(AutoScalerPolicyTest.java:315) at org.apache.maven.surefire.testng.TestNGExecutor.run(TestNGExecutor.java:178) at org.apache.maven.surefire.testng.TestNGXmlTestSuite.execute(TestNGXmlTestSuite.java:92) at org.apache.maven.surefire.testng.TestNGProvider.invoke(TestNGProvider.java:96) at org.apache.maven.surefire.util.ReflectionUtils.invokeMethodWithArray2(ReflectionUtils.java:208) at org.apache.maven.surefire.booter.ProviderFactory$ProviderProxy.invoke(ProviderFactory.java:158) at org.apache.maven.surefire.booter.ProviderFactory.invokeProvider(ProviderFactory.java:86) at org.apache.maven.surefire.booter.ForkedBooter.runSuitesInProcess(ForkedBooter.java:153) at org.apache.maven.surefire.booter.ForkedBooter.main(ForkedBooter.java:95) ... Removed 30 stack frames
java.lang.AssertionError: expected [2] but found [1] at org.testng.Assert.fail(Assert.java:94) at org.testng.Assert.failNotEquals(Assert.java:494) at org.testng.Assert.assertEquals(Assert.java:123) at org.testng.Assert.assertEquals(Assert.java:165) at at.ac.testing.brooklyn.literal.AutoScalerPolicyTest.testResizeDownStabilizationDelayIgnoresBlip(AutoScalerPolicyTest.java:315) at sun.reflect.NativeMethodAccessorImpl.invoke0(Native Method) at sun.reflect.NativeMethodAccessorImpl.invoke(NativeMethodAccessorImpl.java:57) at sun.reflect.DelegatingMethodAccessorImpl.invoke(DelegatingMethodAccessorImpl.java:43) at java.lang.reflect.Method.invoke(Method.java:606) at org.testng.internal.MethodInvocationHelper.invokeMethod(MethodInvocationHelper.java:80) at org.testng.internal.Invoker.invokeMethod(Invoker.java:714) at org.testng.internal.Invoker.invokeTestMethod(Invoker.java:901) at org.testng.internal.Invoker.invokeTestMethods(Invoker.java:1231) at org.testng.internal.TestMethodWorker.invokeTestMethods(TestMethodWorker.java:127) at org.testng.internal.TestMethodWorker.run(TestMethodWorker.java:111) at org.testng.TestRunner.privateRun(TestRunner.java:767) at org.testng.TestRunner.run(TestRunner.java:617) at org.testng.SuiteRunner.runTest(SuiteRunner.java:334) at org.testng.SuiteRunner.runSequentially(SuiteRunner.java:329) at org.testng.SuiteRunner.privateRun(SuiteRunner.java:291) at org.testng.SuiteRunner.run(SuiteRunner.java:240) at org.testng.SuiteRunnerWorker.runSuite(SuiteRunnerWorker.java:52) at org.testng.SuiteRunnerWorker.run(SuiteRunnerWorker.java:86) at org.testng.TestNG.runSuitesSequentially(TestNG.java:1198) at org.testng.TestNG.runSuitesSequentially(TestNG.java:1194) at org.testng.TestNG.runSuitesLocally(TestNG.java:1123) at org.testng.TestNG.run(TestNG.java:1031) at org.apache.maven.surefire.testng.TestNGExecutor.run(TestNGExecutor.java:178) at org.apache.maven.surefire.testng.TestNGXmlTestSuite.execute(TestNGXmlTestSuite.java:92) at org.apache.maven.surefire.testng.TestNGProvider.invoke(TestNGProvider.java:96) at sun.reflect.NativeMethodAccessorImpl.invoke0(Native Method) at sun.reflect.NativeMethodAccessorImpl.invoke(NativeMethodAccessorImpl.java:57) at sun.reflect.DelegatingMethodAccessorImpl.invoke(DelegatingMethodAccessorImpl.java:43) at java.lang.reflect.Method.invoke(Method.java:606) at org.apache.maven.surefire.util.ReflectionUtils.invokeMethodWithArray2(ReflectionUtils.java:208) at org.apache.maven.surefire.booter.ProviderFactory$ProviderProxy.invoke(ProviderFactory.java:158) at org.apache.maven.surefire.booter.ProviderFactory.invokeProvider(ProviderFactory.java:86) at org.apache.maven.surefire.booter.ForkedBooter.runSuitesInProcess(ForkedBooter.java:153) at org.apache.maven.surefire.booter.ForkedBooter.main(ForkedBooter.java:95) "

org.testng.Assert.fail(Assert.java:94)
org.testng.Assert.failNotEquals(Assert.java:494)
org.testng.Assert.assertEquals(Assert.java:123)
org.testng.Assert.assertEquals(Assert.java:165)
at.ac.testing.brooklyn.literal.AutoScalerPolicyTest.testResizeDownStabilizationDelayIgnoresBlip(AutoScalerPolicyTest.java:315)
sun.reflect.NativeMethodAccessorImpl.invoke0(Native Method)
sun.reflect.NativeMethodAccessorImpl.invoke(NativeMethodAccessorImpl.java:57)
sun.reflect.DelegatingMethodAccessorImpl.invoke(DelegatingMethodAccessorImpl.java:43)
java.lang.reflect.Method.invoke(Method.java:606)
org.testng.internal.MethodInvocationHelper.invokeMethod(MethodInvocationHelper.java:80)
org.testng.internal.Invoker.invokeMethod(Invoker.java:714)
org.testng.internal.Invoker.invokeTestMethod(Invoker.java:901)
org.testng.internal.Invoker.invokeTestMethods(Invoker.java:1231)
org.testng.internal.TestMethodWorker.invokeTestMethods(TestMethodWorker.java:127)
org.testng.internal.TestMethodWorker.run(TestMethodWorker.java:111)
org.testng.TestRunner.privateRun(TestRunner.java:767)
org.testng.TestRunner.run(TestRunner.java:617)
org.testng.SuiteRunner.runTest(SuiteRunner.java:334)
org.testng.SuiteRunner.runSequentially(SuiteRunner.java:329)
org.testng.SuiteRunner.privateRun(SuiteRunner.java:291)
org.testng.SuiteRunner.run(SuiteRunner.java:240)
org.testng.SuiteRunnerWorker.runSuite(SuiteRunnerWorker.java:52)
org.testng.SuiteRunnerWorker.run(SuiteRunnerWorker.java:86)
org.testng.TestNG.runSuitesSequentially(TestNG.java:1198)
org.testng.TestNG.runSuitesSequentially(TestNG.java:1194)
org.testng.TestNG.runSuitesLocally(TestNG.java:1123)
org.testng.TestNG.run(TestNG.java:1031)
org.apache.maven.surefire.testng.TestNGExecutor.run(TestNGExecutor.java:178)
org.apache.maven.surefire.testng.TestNGXmlTestSuite.execute(TestNGXmlTestSuite.java:92)
org.apache.maven.surefire.testng.TestNGProvider.invoke(TestNGProvider.java:96)
sun.reflect.NativeMethodAccessorImpl.invoke0(Native Method)
sun.reflect.NativeMethodAccessorImpl.invoke(NativeMethodAccessorImpl.java:57)
sun.reflect.DelegatingMethodAccessorImpl.invoke(DelegatingMethodAccessorImpl.java:43)
java.lang.reflect.Method.invoke(Method.java:606)
org.apache.maven.surefire.util.ReflectionUtils.invokeMethodWithArray2(ReflectionUtils.java:208)
org.apache.maven.surefire.booter.ProviderFactory$ProviderProxy.invoke(ProviderFactory.java:158)
org.apache.maven.surefire.booter.ProviderFactory.invokeProvider(ProviderFactory.java:86)
org.apache.maven.surefire.booter.ForkedBooter.runSuitesInProcess(ForkedBooter.java:153)
org.apache.maven.surefire.booter.ForkedBooter.main(ForkedBooter.java:95)
testResizeDownStabilizationDelayTakesMinSustainedDesired
"java.lang.AssertionError: Resizing to 2: time=2337; resizeDownStabilizationDelay=1100 expected [true] but found [false] at at.ac.testing.brooklyn.literal.AutoScalerPolicyTest.testResizeDownStabilizationDelayTakesMinSustainedDesired(AutoScalerPolicyTest.java:373) at org.apache.maven.surefire.testng.TestNGExecutor.run(TestNGExecutor.java:178) at org.apache.maven.surefire.testng.TestNGXmlTestSuite.execute(TestNGXmlTestSuite.java:92) at org.apache.maven.surefire.testng.TestNGProvider.invoke(TestNGProvider.java:96) at org.apache.maven.surefire.util.ReflectionUtils.invokeMethodWithArray2(ReflectionUtils.java:208) at org.apache.maven.surefire.booter.ProviderFactory$ProviderProxy.invoke(ProviderFactory.java:158) at org.apache.maven.surefire.booter.ProviderFactory.invokeProvider(ProviderFactory.java:86) at org.apache.maven.surefire.booter.ForkedBooter.runSuitesInProcess(ForkedBooter.java:153) at org.apache.maven.surefire.booter.ForkedBooter.main(ForkedBooter.java:95) ... Removed 29 stack frames
java.lang.AssertionError: Resizing to 2: time=2337; resizeDownStabilizationDelay=1100 expected [true] but found [false] at org.testng.Assert.fail(Assert.java:94) at org.testng.Assert.failNotEquals(Assert.java:494) at org.testng.Assert.assertTrue(Assert.java:42) at at.ac.testing.brooklyn.literal.AutoScalerPolicyTest.testResizeDownStabilizationDelayTakesMinSustainedDesired(AutoScalerPolicyTest.java:373) at sun.reflect.NativeMethodAccessorImpl.invoke0(Native Method) at sun.reflect.NativeMethodAccessorImpl.invoke(NativeMethodAccessorImpl.java:57) at sun.reflect.DelegatingMethodAccessorImpl.invoke(DelegatingMethodAccessorImpl.java:43) at java.lang.reflect.Method.invoke(Method.java:606) at org.testng.internal.MethodInvocationHelper.invokeMethod(MethodInvocationHelper.java:80) at org.testng.internal.Invoker.invokeMethod(Invoker.java:714) at org.testng.internal.Invoker.invokeTestMethod(Invoker.java:901) at org.testng.internal.Invoker.invokeTestMethods(Invoker.java:1231) at org.testng.internal.TestMethodWorker.invokeTestMethods(TestMethodWorker.java:127) at org.testng.internal.TestMethodWorker.run(TestMethodWorker.java:111) at org.testng.TestRunner.privateRun(TestRunner.java:767) at org.testng.TestRunner.run(TestRunner.java:617) at org.testng.SuiteRunner.runTest(SuiteRunner.java:334) at org.testng.SuiteRunner.runSequentially(SuiteRunner.java:329) at org.testng.SuiteRunner.privateRun(SuiteRunner.java:291) at org.testng.SuiteRunner.run(SuiteRunner.java:240) at org.testng.SuiteRunnerWorker.runSuite(SuiteRunnerWorker.java:52) at org.testng.SuiteRunnerWorker.run(SuiteRunnerWorker.java:86) at org.testng.TestNG.runSuitesSequentially(TestNG.java:1198) at org.testng.TestNG.runSuitesSequentially(TestNG.java:1194) at org.testng.TestNG.runSuitesLocally(TestNG.java:1123) at org.testng.TestNG.run(TestNG.java:1031) at org.apache.maven.surefire.testng.TestNGExecutor.run(TestNGExecutor.java:178) at org.apache.maven.surefire.testng.TestNGXmlTestSuite.execute(TestNGXmlTestSuite.java:92) at org.apache.maven.surefire.testng.TestNGProvider.invoke(TestNGProvider.java:96) at sun.reflect.NativeMethodAccessorImpl.invoke0(Native Method) at sun.reflect.NativeMethodAccessorImpl.invoke(NativeMethodAccessorImpl.java:57) at sun.reflect.DelegatingMethodAccessorImpl.invoke(DelegatingMethodAccessorImpl.java:43) at java.lang.reflect.Method.invoke(Method.java:606) at org.apache.maven.surefire.util.ReflectionUtils.invokeMethodWithArray2(ReflectionUtils.java:208) at org.apache.maven.surefire.booter.ProviderFactory$ProviderProxy.invoke(ProviderFactory.java:158) at org.apache.maven.surefire.booter.ProviderFactory.invokeProvider(ProviderFactory.java:86) at org.apache.maven.surefire.booter.ForkedBooter.runSuitesInProcess(ForkedBooter.java:153) at org.apache.maven.surefire.booter.ForkedBooter.main(ForkedBooter.java:95) "

org.testng.Assert.fail(Assert.java:94)
org.testng.Assert.failNotEquals(Assert.java:494)
org.testng.Assert.assertTrue(Assert.java:42)
at.ac.testing.brooklyn.literal.AutoScalerPolicyTest.testResizeDownStabilizationDelayTakesMinSustainedDesired(AutoScalerPolicyTest.java:373)
sun.reflect.NativeMethodAccessorImpl.invoke0(Native Method)
sun.reflect.NativeMethodAccessorImpl.invoke(NativeMethodAccessorImpl.java:57)
sun.reflect.DelegatingMethodAccessorImpl.invoke(DelegatingMethodAccessorImpl.java:43)
java.lang.reflect.Method.invoke(Method.java:606)
org.testng.internal.MethodInvocationHelper.invokeMethod(MethodInvocationHelper.java:80)
org.testng.internal.Invoker.invokeMethod(Invoker.java:714)
org.testng.internal.Invoker.invokeTestMethod(Invoker.java:901)
org.testng.internal.Invoker.invokeTestMethods(Invoker.java:1231)
org.testng.internal.TestMethodWorker.invokeTestMethods(TestMethodWorker.java:127)
org.testng.internal.TestMethodWorker.run(TestMethodWorker.java:111)
org.testng.TestRunner.privateRun(TestRunner.java:767)
org.testng.TestRunner.run(TestRunner.java:617)
org.testng.SuiteRunner.runTest(SuiteRunner.java:334)
org.testng.SuiteRunner.runSequentially(SuiteRunner.java:329)
org.testng.SuiteRunner.privateRun(SuiteRunner.java:291)
org.testng.SuiteRunner.run(SuiteRunner.java:240)
org.testng.SuiteRunnerWorker.runSuite(SuiteRunnerWorker.java:52)
org.testng.SuiteRunnerWorker.run(SuiteRunnerWorker.java:86)
org.testng.TestNG.runSuitesSequentially(TestNG.java:1198)
org.testng.TestNG.runSuitesSequentially(TestNG.java:1194)
org.testng.TestNG.runSuitesLocally(TestNG.java:1123)
org.testng.TestNG.run(TestNG.java:1031)
org.apache.maven.surefire.testng.TestNGExecutor.run(TestNGExecutor.java:178)
org.apache.maven.surefire.testng.TestNGXmlTestSuite.execute(TestNGXmlTestSuite.java:92)
org.apache.maven.surefire.testng.TestNGProvider.invoke(TestNGProvider.java:96)
sun.reflect.NativeMethodAccessorImpl.invoke0(Native Method)
sun.reflect.NativeMethodAccessorImpl.invoke(NativeMethodAccessorImpl.java:57)
sun.reflect.DelegatingMethodAccessorImpl.invoke(DelegatingMethodAccessorImpl.java:43)
java.lang.reflect.Method.invoke(Method.java:606)
org.apache.maven.surefire.util.ReflectionUtils.invokeMethodWithArray2(ReflectionUtils.java:208)
org.apache.maven.surefire.booter.ProviderFactory$ProviderProxy.invoke(ProviderFactory.java:158)
org.apache.maven.surefire.booter.ProviderFactory.invokeProvider(ProviderFactory.java:86)
org.apache.maven.surefire.booter.ForkedBooter.runSuitesInProcess(ForkedBooter.java:153)
org.apache.maven.surefire.booter.ForkedBooter.main(ForkedBooter.java:95)
testResizeUpStabilizationDelayIgnoresBlip
"java.lang.AssertionError: expected [1] but found [4] at at.ac.testing.brooklyn.literal.AutoScalerPolicyTest.testResizeUpStabilizationDelayIgnoresBlip(AutoScalerPolicyTest.java:185) at org.apache.maven.surefire.testng.TestNGExecutor.run(TestNGExecutor.java:178) at org.apache.maven.surefire.testng.TestNGXmlTestSuite.execute(TestNGXmlTestSuite.java:92) at org.apache.maven.surefire.testng.TestNGProvider.invoke(TestNGProvider.java:96) at org.apache.maven.surefire.util.ReflectionUtils.invokeMethodWithArray2(ReflectionUtils.java:208) at org.apache.maven.surefire.booter.ProviderFactory$ProviderProxy.invoke(ProviderFactory.java:158) at org.apache.maven.surefire.booter.ProviderFactory.invokeProvider(ProviderFactory.java:86) at org.apache.maven.surefire.booter.ForkedBooter.runSuitesInProcess(ForkedBooter.java:153) at org.apache.maven.surefire.booter.ForkedBooter.main(ForkedBooter.java:95) ... Removed 30 stack frames
java.lang.AssertionError: expected [1] but found [4] at org.testng.Assert.fail(Assert.java:94) at org.testng.Assert.failNotEquals(Assert.java:494) at org.testng.Assert.assertEquals(Assert.java:123) at org.testng.Assert.assertEquals(Assert.java:165) at at.ac.testing.brooklyn.literal.AutoScalerPolicyTest.testResizeUpStabilizationDelayIgnoresBlip(AutoScalerPolicyTest.java:185) at sun.reflect.NativeMethodAccessorImpl.invoke0(Native Method) at sun.reflect.NativeMethodAccessorImpl.invoke(NativeMethodAccessorImpl.java:57) at sun.reflect.DelegatingMethodAccessorImpl.invoke(DelegatingMethodAccessorImpl.java:43) at java.lang.reflect.Method.invoke(Method.java:606) at org.testng.internal.MethodInvocationHelper.invokeMethod(MethodInvocationHelper.java:80) at org.testng.internal.Invoker.invokeMethod(Invoker.java:714) at org.testng.internal.Invoker.invokeTestMethod(Invoker.java:901) at org.testng.internal.Invoker.invokeTestMethods(Invoker.java:1231) at org.testng.internal.TestMethodWorker.invokeTestMethods(TestMethodWorker.java:127) at org.testng.internal.TestMethodWorker.run(TestMethodWorker.java:111) at org.testng.TestRunner.privateRun(TestRunner.java:767) at org.testng.TestRunner.run(TestRunner.java:617) at org.testng.SuiteRunner.runTest(SuiteRunner.java:334) at org.testng.SuiteRunner.runSequentially(SuiteRunner.java:329) at org.testng.SuiteRunner.privateRun(SuiteRunner.java:291) at org.testng.SuiteRunner.run(SuiteRunner.java:240) at org.testng.SuiteRunnerWorker.runSuite(SuiteRunnerWorker.java:52) at org.testng.SuiteRunnerWorker.run(SuiteRunnerWorker.java:86) at org.testng.TestNG.runSuitesSequentially(TestNG.java:1198) at org.testng.TestNG.runSuitesSequentially(TestNG.java:1194) at org.testng.TestNG.runSuitesLocally(TestNG.java:1123) at org.testng.TestNG.run(TestNG.java:1031) at org.apache.maven.surefire.testng.TestNGExecutor.run(TestNGExecutor.java:178) at org.apache.maven.surefire.testng.TestNGXmlTestSuite.execute(TestNGXmlTestSuite.java:92) at org.apache.maven.surefire.testng.TestNGProvider.invoke(TestNGProvider.java:96) at sun.reflect.NativeMethodAccessorImpl.invoke0(Native Method) at sun.reflect.NativeMethodAccessorImpl.invoke(NativeMethodAccessorImpl.java:57) at sun.reflect.DelegatingMethodAccessorImpl.invoke(DelegatingMethodAccessorImpl.java:43) at java.lang.reflect.Method.invoke(Method.java:606) at org.apache.maven.surefire.util.ReflectionUtils.invokeMethodWithArray2(ReflectionUtils.java:208) at org.apache.maven.surefire.booter.ProviderFactory$ProviderProxy.invoke(ProviderFactory.java:158) at org.apache.maven.surefire.booter.ProviderFactory.invokeProvider(ProviderFactory.java:86) at org.apache.maven.surefire.booter.ForkedBooter.runSuitesInProcess(ForkedBooter.java:153) at org.apache.maven.surefire.booter.ForkedBooter.main(ForkedBooter.java:95) "

org.testng.Assert.fail(Assert.java:94)
org.testng.Assert.failNotEquals(Assert.java:494)
org.testng.Assert.assertEquals(Assert.java:123)
org.testng.Assert.assertEquals(Assert.java:165)
at.ac.testing.brooklyn.literal.AutoScalerPolicyTest.testResizeUpStabilizationDelayIgnoresBlip(AutoScalerPolicyTest.java:185)
sun.reflect.NativeMethodAccessorImpl.invoke0(Native Method)
sun.reflect.NativeMethodAccessorImpl.invoke(NativeMethodAccessorImpl.java:57)
sun.reflect.DelegatingMethodAccessorImpl.invoke(DelegatingMethodAccessorImpl.java:43)
java.lang.reflect.Method.invoke(Method.java:606)
org.testng.internal.MethodInvocationHelper.invokeMethod(MethodInvocationHelper.java:80)
org.testng.internal.Invoker.invokeMethod(Invoker.java:714)
org.testng.internal.Invoker.invokeTestMethod(Invoker.java:901)
org.testng.internal.Invoker.invokeTestMethods(Invoker.java:1231)
org.testng.internal.TestMethodWorker.invokeTestMethods(TestMethodWorker.java:127)
org.testng.internal.TestMethodWorker.run(TestMethodWorker.java:111)
org.testng.TestRunner.privateRun(TestRunner.java:767)
org.testng.TestRunner.run(TestRunner.java:617)
org.testng.SuiteRunner.runTest(SuiteRunner.java:334)
org.testng.SuiteRunner.runSequentially(SuiteRunner.java:329)
org.testng.SuiteRunner.privateRun(SuiteRunner.java:291)
org.testng.SuiteRunner.run(SuiteRunner.java:240)
org.testng.SuiteRunnerWorker.runSuite(SuiteRunnerWorker.java:52)
org.testng.SuiteRunnerWorker.run(SuiteRunnerWorker.java:86)
org.testng.TestNG.runSuitesSequentially(TestNG.java:1198)
org.testng.TestNG.runSuitesSequentially(TestNG.java:1194)
org.testng.TestNG.runSuitesLocally(TestNG.java:1123)
org.testng.TestNG.run(TestNG.java:1031)
org.apache.maven.surefire.testng.TestNGExecutor.run(TestNGExecutor.java:178)
org.apache.maven.surefire.testng.TestNGXmlTestSuite.execute(TestNGXmlTestSuite.java:92)
org.apache.maven.surefire.testng.TestNGProvider.invoke(TestNGProvider.java:96)
sun.reflect.NativeMethodAccessorImpl.invoke0(Native Method)
sun.reflect.NativeMethodAccessorImpl.invoke(NativeMethodAccessorImpl.java:57)
sun.reflect.DelegatingMethodAccessorImpl.invoke(DelegatingMethodAccessorImpl.java:43)
java.lang.reflect.Method.invoke(Method.java:606)
org.apache.maven.surefire.util.ReflectionUtils.invokeMethodWithArray2(ReflectionUtils.java:208)
org.apache.maven.surefire.booter.ProviderFactory$ProviderProxy.invoke(ProviderFactory.java:158)
org.apache.maven.surefire.booter.ProviderFactory.invokeProvider(ProviderFactory.java:86)
org.apache.maven.surefire.booter.ForkedBooter.runSuitesInProcess(ForkedBooter.java:153)
org.apache.maven.surefire.booter.ForkedBooter.main(ForkedBooter.java:95)
testResizeUpStabilizationDelayTakesMaxSustainedDesired
"java.lang.AssertionError: Resizing to 2: time=2349; resizeUpStabilizationDelay=1100 expected [true] but found [false] at at.ac.testing.brooklyn.literal.AutoScalerPolicyTest.testResizeUpStabilizationDelayTakesMaxSustainedDesired(AutoScalerPolicyTest.java:244) at org.apache.maven.surefire.testng.TestNGExecutor.run(TestNGExecutor.java:178) at org.apache.maven.surefire.testng.TestNGXmlTestSuite.execute(TestNGXmlTestSuite.java:92) at org.apache.maven.surefire.testng.TestNGProvider.invoke(TestNGProvider.java:96) at org.apache.maven.surefire.util.ReflectionUtils.invokeMethodWithArray2(ReflectionUtils.java:208) at org.apache.maven.surefire.booter.ProviderFactory$ProviderProxy.invoke(ProviderFactory.java:158) at org.apache.maven.surefire.booter.ProviderFactory.invokeProvider(ProviderFactory.java:86) at org.apache.maven.surefire.booter.ForkedBooter.runSuitesInProcess(ForkedBooter.java:153) at org.apache.maven.surefire.booter.ForkedBooter.main(ForkedBooter.java:95) ... Removed 29 stack frames
java.lang.AssertionError: Resizing to 2: time=2349; resizeUpStabilizationDelay=1100 expected [true] but found [false] at org.testng.Assert.fail(Assert.java:94) at org.testng.Assert.failNotEquals(Assert.java:494) at org.testng.Assert.assertTrue(Assert.java:42) at at.ac.testing.brooklyn.literal.AutoScalerPolicyTest.testResizeUpStabilizationDelayTakesMaxSustainedDesired(AutoScalerPolicyTest.java:244) at sun.reflect.NativeMethodAccessorImpl.invoke0(Native Method) at sun.reflect.NativeMethodAccessorImpl.invoke(NativeMethodAccessorImpl.java:57) at sun.reflect.DelegatingMethodAccessorImpl.invoke(DelegatingMethodAccessorImpl.java:43) at java.lang.reflect.Method.invoke(Method.java:606) at org.testng.internal.MethodInvocationHelper.invokeMethod(MethodInvocationHelper.java:80) at org.testng.internal.Invoker.invokeMethod(Invoker.java:714) at org.testng.internal.Invoker.invokeTestMethod(Invoker.java:901) at org.testng.internal.Invoker.invokeTestMethods(Invoker.java:1231) at org.testng.internal.TestMethodWorker.invokeTestMethods(TestMethodWorker.java:127) at org.testng.internal.TestMethodWorker.run(TestMethodWorker.java:111) at org.testng.TestRunner.privateRun(TestRunner.java:767) at org.testng.TestRunner.run(TestRunner.java:617) at org.testng.SuiteRunner.runTest(SuiteRunner.java:334) at org.testng.SuiteRunner.runSequentially(SuiteRunner.java:329) at org.testng.SuiteRunner.privateRun(SuiteRunner.java:291) at org.testng.SuiteRunner.run(SuiteRunner.java:240) at org.testng.SuiteRunnerWorker.runSuite(SuiteRunnerWorker.java:52) at org.testng.SuiteRunnerWorker.run(SuiteRunnerWorker.java:86) at org.testng.TestNG.runSuitesSequentially(TestNG.java:1198) at org.testng.TestNG.runSuitesSequentially(TestNG.java:1194) at org.testng.TestNG.runSuitesLocally(TestNG.java:1123) at org.testng.TestNG.run(TestNG.java:1031) at org.apache.maven.surefire.testng.TestNGExecutor.run(TestNGExecutor.java:178) at org.apache.maven.surefire.testng.TestNGXmlTestSuite.execute(TestNGXmlTestSuite.java:92) at org.apache.maven.surefire.testng.TestNGProvider.invoke(TestNGProvider.java:96) at sun.reflect.NativeMethodAccessorImpl.invoke0(Native Method) at sun.reflect.NativeMethodAccessorImpl.invoke(NativeMethodAccessorImpl.java:57) at sun.reflect.DelegatingMethodAccessorImpl.invoke(DelegatingMethodAccessorImpl.java:43) at java.lang.reflect.Method.invoke(Method.java:606) at org.apache.maven.surefire.util.ReflectionUtils.invokeMethodWithArray2(ReflectionUtils.java:208) at org.apache.maven.surefire.booter.ProviderFactory$ProviderProxy.invoke(ProviderFactory.java:158) at org.apache.maven.surefire.booter.ProviderFactory.invokeProvider(ProviderFactory.java:86) at org.apache.maven.surefire.booter.ForkedBooter.runSuitesInProcess(ForkedBooter.java:153) at org.apache.maven.surefire.booter.ForkedBooter.main(ForkedBooter.java:95) "

org.testng.Assert.fail(Assert.java:94)
org.testng.Assert.failNotEquals(Assert.java:494)
org.testng.Assert.assertTrue(Assert.java:42)
at.ac.testing.brooklyn.literal.AutoScalerPolicyTest.testResizeUpStabilizationDelayTakesMaxSustainedDesired(AutoScalerPolicyTest.java:244)
sun.reflect.NativeMethodAccessorImpl.invoke0(Native Method)
sun.reflect.NativeMethodAccessorImpl.invoke(NativeMethodAccessorImpl.java:57)
sun.reflect.DelegatingMethodAccessorImpl.invoke(DelegatingMethodAccessorImpl.java:43)
java.lang.reflect.Method.invoke(Method.java:606)
org.testng.internal.MethodInvocationHelper.invokeMethod(MethodInvocationHelper.java:80)
org.testng.internal.Invoker.invokeMethod(Invoker.java:714)
org.testng.internal.Invoker.invokeTestMethod(Invoker.java:901)
org.testng.internal.Invoker.invokeTestMethods(Invoker.java:1231)
org.testng.internal.TestMethodWorker.invokeTestMethods(TestMethodWorker.java:127)
org.testng.internal.TestMethodWorker.run(TestMethodWorker.java:111)
org.testng.TestRunner.privateRun(TestRunner.java:767)
org.testng.TestRunner.run(TestRunner.java:617)
org.testng.SuiteRunner.runTest(SuiteRunner.java:334)
org.testng.SuiteRunner.runSequentially(SuiteRunner.java:329)
org.testng.SuiteRunner.privateRun(SuiteRunner.java:291)
org.testng.SuiteRunner.run(SuiteRunner.java:240)
org.testng.SuiteRunnerWorker.runSuite(SuiteRunnerWorker.java:52)
org.testng.SuiteRunnerWorker.run(SuiteRunnerWorker.java:86)
org.testng.TestNG.runSuitesSequentially(TestNG.java:1198)
org.testng.TestNG.runSuitesSequentially(TestNG.java:1194)
org.testng.TestNG.runSuitesLocally(TestNG.java:1123)
org.testng.TestNG.run(TestNG.java:1031)
org.apache.maven.surefire.testng.TestNGExecutor.run(TestNGExecutor.java:178)
org.apache.maven.surefire.testng.TestNGXmlTestSuite.execute(TestNGXmlTestSuite.java:92)
org.apache.maven.surefire.testng.TestNGProvider.invoke(TestNGProvider.java:96)
sun.reflect.NativeMethodAccessorImpl.invoke0(Native Method)
sun.reflect.NativeMethodAccessorImpl.invoke(NativeMethodAccessorImpl.java:57)
sun.reflect.DelegatingMethodAccessorImpl.invoke(DelegatingMethodAccessorImpl.java:43)
java.lang.reflect.Method.invoke(Method.java:606)
org.apache.maven.surefire.util.ReflectionUtils.invokeMethodWithArray2(ReflectionUtils.java:208)
org.apache.maven.surefire.booter.ProviderFactory$ProviderProxy.invoke(ProviderFactory.java:158)
org.apache.maven.surefire.booter.ProviderFactory.invokeProvider(ProviderFactory.java:86)
org.apache.maven.surefire.booter.ForkedBooter.runSuitesInProcess(ForkedBooter.java:153)
org.apache.maven.surefire.booter.ForkedBooter.main(ForkedBooter.java:95)
at.ac.testing.brooklyn.literal.AutoScalerPolicyTest
testNeverGrowAboveMaximmum
"org.testng.SkipException: Missing Precondition: There is not valid integer value to trigger the specified transition! at at.ac.testing.mocks.ThresholdBasedPolicy.resize(ThresholdBasedPolicy.java:107) at at.ac.testing.brooklyn.literal.AutoScalerPolicyTest.testNeverGrowAboveMaximmum(AutoScalerPolicyTest.java:84) at org.apache.maven.surefire.testng.TestNGExecutor.run(TestNGExecutor.java:178) at org.apache.maven.surefire.testng.TestNGXmlTestSuite.execute(TestNGXmlTestSuite.java:92) at org.apache.maven.surefire.testng.TestNGProvider.invoke(TestNGProvider.java:96) at org.apache.maven.surefire.util.ReflectionUtils.invokeMethodWithArray2(ReflectionUtils.java:208) at org.apache.maven.surefire.booter.ProviderFactory$ProviderProxy.invoke(ProviderFactory.java:158) at org.apache.maven.surefire.booter.ProviderFactory.invokeProvider(ProviderFactory.java:86) at org.apache.maven.surefire.booter.ForkedBooter.runSuitesInProcess(ForkedBooter.java:153) at org.apache.maven.surefire.booter.ForkedBooter.main(ForkedBooter.java:95) ... Removed 26 stack frames
org.testng.SkipException: Missing Precondition: There is not valid integer value to trigger the specified transition! at at.ac.testing.mocks.ThresholdBasedPolicy.resize(ThresholdBasedPolicy.java:107) at at.ac.testing.brooklyn.literal.AutoScalerPolicyTest.testNeverGrowAboveMaximmum(AutoScalerPolicyTest.java:84) at sun.reflect.NativeMethodAccessorImpl.invoke0(Native Method) at sun.reflect.NativeMethodAccessorImpl.invoke(NativeMethodAccessorImpl.java:57) at sun.reflect.DelegatingMethodAccessorImpl.invoke(DelegatingMethodAccessorImpl.java:43) at java.lang.reflect.Method.invoke(Method.java:606) at org.testng.internal.MethodInvocationHelper.invokeMethod(MethodInvocationHelper.java:80) at org.testng.internal.Invoker.invokeMethod(Invoker.java:714) at org.testng.internal.Invoker.invokeTestMethod(Invoker.java:901) at org.testng.internal.Invoker.invokeTestMethods(Invoker.java:1231) at org.testng.internal.TestMethodWorker.invokeTestMethods(TestMethodWorker.java:127) at org.testng.internal.TestMethodWorker.run(TestMethodWorker.java:111) at org.testng.TestRunner.privateRun(TestRunner.java:767) at org.testng.TestRunner.run(TestRunner.java:617) at org.testng.SuiteRunner.runTest(SuiteRunner.java:334) at org.testng.SuiteRunner.runSequentially(SuiteRunner.java:329) at org.testng.SuiteRunner.privateRun(SuiteRunner.java:291) at org.testng.SuiteRunner.run(SuiteRunner.java:240) at org.testng.SuiteRunnerWorker.runSuite(SuiteRunnerWorker.java:52) at org.testng.SuiteRunnerWorker.run(SuiteRunnerWorker.java:86) at org.testng.TestNG.runSuitesSequentially(TestNG.java:1198) at org.testng.TestNG.runSuitesSequentially(TestNG.java:1194) at org.testng.TestNG.runSuitesLocally(TestNG.java:1123) at org.testng.TestNG.run(TestNG.java:1031) at org.apache.maven.surefire.testng.TestNGExecutor.run(TestNGExecutor.java:178) at org.apache.maven.surefire.testng.TestNGXmlTestSuite.execute(TestNGXmlTestSuite.java:92) at org.apache.maven.surefire.testng.TestNGProvider.invoke(TestNGProvider.java:96) at sun.reflect.NativeMethodAccessorImpl.invoke0(Native Method) at sun.reflect.NativeMethodAccessorImpl.invoke(NativeMethodAccessorImpl.java:57) at sun.reflect.DelegatingMethodAccessorImpl.invoke(DelegatingMethodAccessorImpl.java:43) at java.lang.reflect.Method.invoke(Method.java:606) at org.apache.maven.surefire.util.ReflectionUtils.invokeMethodWithArray2(ReflectionUtils.java:208) at org.apache.maven.surefire.booter.ProviderFactory$ProviderProxy.invoke(ProviderFactory.java:158) at org.apache.maven.surefire.booter.ProviderFactory.invokeProvider(ProviderFactory.java:86) at org.apache.maven.surefire.booter.ForkedBooter.runSuitesInProcess(ForkedBooter.java:153) at org.apache.maven.surefire.booter.ForkedBooter.main(ForkedBooter.java:95) "

at.ac.testing.mocks.ThresholdBasedPolicy.resize(ThresholdBasedPolicy.java:107)
at.ac.testing.brooklyn.literal.AutoScalerPolicyTest.testNeverGrowAboveMaximmum(AutoScalerPolicyTest.java:84)
sun.reflect.NativeMethodAccessorImpl.invoke0(Native Method)
sun.reflect.NativeMethodAccessorImpl.invoke(NativeMethodAccessorImpl.java:57)
sun.reflect.DelegatingMethodAccessorImpl.invoke(DelegatingMethodAccessorImpl.java:43)
java.lang.reflect.Method.invoke(Method.java:606)
org.testng.internal.MethodInvocationHelper.invokeMethod(MethodInvocationHelper.java:80)
org.testng.internal.Invoker.invokeMethod(Invoker.java:714)
org.testng.internal.Invoker.invokeTestMethod(Invoker.java:901)
org.testng.internal.Invoker.invokeTestMethods(Invoker.java:1231)
org.testng.internal.TestMethodWorker.invokeTestMethods(TestMethodWorker.java:127)
org.testng.internal.TestMethodWorker.run(TestMethodWorker.java:111)
org.testng.TestRunner.privateRun(TestRunner.java:767)
org.testng.TestRunner.run(TestRunner.java:617)
org.testng.SuiteRunner.runTest(SuiteRunner.java:334)
org.testng.SuiteRunner.runSequentially(SuiteRunner.java:329)
org.testng.SuiteRunner.privateRun(SuiteRunner.java:291)
org.testng.SuiteRunner.run(SuiteRunner.java:240)
org.testng.SuiteRunnerWorker.runSuite(SuiteRunnerWorker.java:52)
org.testng.SuiteRunnerWorker.run(SuiteRunnerWorker.java:86)
org.testng.TestNG.runSuitesSequentially(TestNG.java:1198)
org.testng.TestNG.runSuitesSequentially(TestNG.java:1194)
org.testng.TestNG.runSuitesLocally(TestNG.java:1123)
org.testng.TestNG.run(TestNG.java:1031)
org.apache.maven.surefire.testng.TestNGExecutor.run(TestNGExecutor.java:178)
org.apache.maven.surefire.testng.TestNGXmlTestSuite.execute(TestNGXmlTestSuite.java:92)
org.apache.maven.surefire.testng.TestNGProvider.invoke(TestNGProvider.java:96)
sun.reflect.NativeMethodAccessorImpl.invoke0(Native Method)
sun.reflect.NativeMethodAccessorImpl.invoke(NativeMethodAccessorImpl.java:57)
sun.reflect.DelegatingMethodAccessorImpl.invoke(DelegatingMethodAccessorImpl.java:43)
java.lang.reflect.Method.invoke(Method.java:606)
org.apache.maven.surefire.util.ReflectionUtils.invokeMethodWithArray2(ReflectionUtils.java:208)
org.apache.maven.surefire.booter.ProviderFactory$ProviderProxy.invoke(ProviderFactory.java:158)
org.apache.maven.surefire.booter.ProviderFactory.invokeProvider(ProviderFactory.java:86)
org.apache.maven.surefire.booter.ForkedBooter.runSuitesInProcess(ForkedBooter.java:153)
org.apache.maven.surefire.booter.ForkedBooter.main(ForkedBooter.java:95)
at.ac.testing.brooklyn.literal.AutoScalerPolicyTest
testConcurrentGrowGrow
testConcurrentGrowShrink
testConcurrentShrinkGrow
testConcurrentShrinkShrink
testGrowHotPool
testNeverGrowColdPool
testNeverShrinkBelowMinimum
testNeverShrinkHotPool
testResizeDownStabilizationDelayResizesAfterDelay
testResizeUpStabilizationDelayResizesAfterDelay
testShrinkColdPool
testShrinkColdPoolRoundsUpDesiredNumberOfContainers
at.ac.testing.brooklyn.literal.AutoScalerPolicyMetricTest
testDecrementsSizeIffLowerBoundExceeded
testDecrementsSizeInProportionToMetric
testIncrementsSizeIffUpperBoundExceeded
testIncrementsSizeInProportionToMetric
testObeysMinAndMaxSize
testWarnsWhenMaxCapReached
at.ac.testing.brooklyn.mixed.AutoScalerPolicyTest
testResizeDownStabilizationDelayTakesMinSustainedDesired
"java.lang.AssertionError: expected [1] but found [2] at at.ac.testing.brooklyn.original.AutoScalerPolicyTest$7.run(AutoScalerPolicyTest.java:608) at java_lang_Runnable$run.call(Unknown Source) at brooklyn.test.TestUtils$_executeUntilSucceeds_closure5.doCall(TestUtils.groovy:148) at groovy.lang.MetaMethod.doMethodInvoke(MetaMethod.java:233) at org.codehaus.groovy.runtime.metaclass.ClosureMetaClass.invokeMethod(ClosureMetaClass.java:272) at groovy.lang.MetaClassImpl.invokeMethod(MetaClassImpl.java:877) at org.codehaus.groovy.runtime.callsite.PogoMetaClassSite.callCurrent(PogoMetaClassSite.java:66) at org.codehaus.groovy.runtime.callsite.AbstractCallSite.callCurrent(AbstractCallSite.java:141) at brooklyn.test.TestUtils$_executeUntilSucceeds_closure5.doCall(TestUtils.groovy) at groovy.lang.MetaMethod.doMethodInvoke(MetaMethod.java:233) at org.codehaus.groovy.runtime.metaclass.ClosureMetaClass.invokeMethod(ClosureMetaClass.java:272) at groovy.lang.MetaClassImpl.invokeMethod(MetaClassImpl.java:877) at org.codehaus.groovy.runtime.callsite.PogoMetaClassSite.call(PogoMetaClassSite.java:39) at org.codehaus.groovy.runtime.callsite.AbstractCallSite.call(AbstractCallSite.java:112) at brooklyn.test.TestUtils.executeUntilSucceedsWithFinallyBlockInternal(TestUtils.groovy:243) at org.codehaus.groovy.runtime.callsite.StaticMetaMethodSite$StaticMetaMethodSiteNoUnwrapNoCoerce.invoke(StaticMetaMethodSite.java:148) at org.codehaus.groovy.runtime.callsite.StaticMetaMethodSite.callStatic(StaticMetaMethodSite.java:99) at org.codehaus.groovy.runtime.callsite.AbstractCallSite.callStatic(AbstractCallSite.java:173) at brooklyn.test.TestUtils.executeUntilSucceedsWithFinallyBlock(TestUtils.groovy:208) at brooklyn.test.TestUtils$executeUntilSucceedsWithFinallyBlock.callStatic(Unknown Source) at brooklyn.test.TestUtils.executeUntilSucceeds(TestUtils.groovy:148) at at.ac.testing.brooklyn.mixed.AutoScalerPolicyTest.testResizeDownStabilizationDelayTakesMinSustainedDesired(AutoScalerPolicyTest.java:437) at org.apache.maven.surefire.testng.TestNGExecutor.run(TestNGExecutor.java:178) at org.apache.maven.surefire.testng.TestNGXmlTestSuite.execute(TestNGXmlTestSuite.java:92) at org.apache.maven.surefire.testng.TestNGProvider.invoke(TestNGProvider.java:96) at org.apache.maven.surefire.util.ReflectionUtils.invokeMethodWithArray2(ReflectionUtils.java:208) at org.apache.maven.surefire.booter.ProviderFactory$ProviderProxy.invoke(ProviderFactory.java:158) at org.apache.maven.surefire.booter.ProviderFactory.invokeProvider(ProviderFactory.java:86) at org.apache.maven.surefire.booter.ForkedBooter.runSuitesInProcess(ForkedBooter.java:153) at org.apache.maven.surefire.booter.ForkedBooter.main(ForkedBooter.java:95) ... Removed 42 stack frames
java.lang.AssertionError: expected [1] but found [2] at org.testng.Assert.fail(Assert.java:94) at org.testng.Assert.failNotEquals(Assert.java:494) at org.testng.Assert.assertEquals(Assert.java:123) at org.testng.Assert.assertEquals(Assert.java:165) at at.ac.testing.brooklyn.original.AutoScalerPolicyTest$7.run(AutoScalerPolicyTest.java:608) at java_lang_Runnable$run.call(Unknown Source) at brooklyn.test.TestUtils$_executeUntilSucceeds_closure5.doCall(TestUtils.groovy:148) at sun.reflect.GeneratedMethodAccessor6.invoke(Unknown Source) at sun.reflect.DelegatingMethodAccessorImpl.invoke(DelegatingMethodAccessorImpl.java:43) at java.lang.reflect.Method.invoke(Method.java:606) at org.codehaus.groovy.reflection.CachedMethod.invoke(CachedMethod.java:90) at groovy.lang.MetaMethod.doMethodInvoke(MetaMethod.java:233) at org.codehaus.groovy.runtime.metaclass.ClosureMetaClass.invokeMethod(ClosureMetaClass.java:272) at groovy.lang.MetaClassImpl.invokeMethod(MetaClassImpl.java:877) at org.codehaus.groovy.runtime.callsite.PogoMetaClassSite.callCurrent(PogoMetaClassSite.java:66) at org.codehaus.groovy.runtime.callsite.AbstractCallSite.callCurrent(AbstractCallSite.java:141) at brooklyn.test.TestUtils$_executeUntilSucceeds_closure5.doCall(TestUtils.groovy) at sun.reflect.GeneratedMethodAccessor5.invoke(Unknown Source) at sun.reflect.DelegatingMethodAccessorImpl.invoke(DelegatingMethodAccessorImpl.java:43) at java.lang.reflect.Method.invoke(Method.java:606) at org.codehaus.groovy.reflection.CachedMethod.invoke(CachedMethod.java:90) at groovy.lang.MetaMethod.doMethodInvoke(MetaMethod.java:233) at org.codehaus.groovy.runtime.metaclass.ClosureMetaClass.invokeMethod(ClosureMetaClass.java:272) at groovy.lang.MetaClassImpl.invokeMethod(MetaClassImpl.java:877) at org.codehaus.groovy.runtime.callsite.PogoMetaClassSite.call(PogoMetaClassSite.java:39) at org.codehaus.groovy.runtime.callsite.AbstractCallSite.call(AbstractCallSite.java:112) at brooklyn.test.TestUtils.executeUntilSucceedsWithFinallyBlockInternal(TestUtils.groovy:243) at sun.reflect.GeneratedMethodAccessor35.invoke(Unknown Source) at sun.reflect.DelegatingMethodAccessorImpl.invoke(DelegatingMethodAccessorImpl.java:43) at java.lang.reflect.Method.invoke(Method.java:606) at org.codehaus.groovy.reflection.CachedMethod.invoke(CachedMethod.java:90) at org.codehaus.groovy.runtime.callsite.StaticMetaMethodSite$StaticMetaMethodSiteNoUnwrapNoCoerce.invoke(StaticMetaMethodSite.java:148) at org.codehaus.groovy.runtime.callsite.StaticMetaMethodSite.callStatic(StaticMetaMethodSite.java:99) at org.codehaus.groovy.runtime.callsite.AbstractCallSite.callStatic(AbstractCallSite.java:173) at brooklyn.test.TestUtils.executeUntilSucceedsWithFinallyBlock(TestUtils.groovy:208) at brooklyn.test.TestUtils$executeUntilSucceedsWithFinallyBlock.callStatic(Unknown Source) at brooklyn.test.TestUtils.executeUntilSucceeds(TestUtils.groovy:148) at at.ac.testing.brooklyn.mixed.AutoScalerPolicyTest.testResizeDownStabilizationDelayTakesMinSustainedDesired(AutoScalerPolicyTest.java:437) at sun.reflect.NativeMethodAccessorImpl.invoke0(Native Method) at sun.reflect.NativeMethodAccessorImpl.invoke(NativeMethodAccessorImpl.java:57) at sun.reflect.DelegatingMethodAccessorImpl.invoke(DelegatingMethodAccessorImpl.java:43) at java.lang.reflect.Method.invoke(Method.java:606) at org.testng.internal.MethodInvocationHelper.invokeMethod(MethodInvocationHelper.java:80) at org.testng.internal.Invoker.invokeMethod(Invoker.java:714) at org.testng.internal.Invoker.invokeTestMethod(Invoker.java:901) at org.testng.internal.Invoker.invokeTestMethods(Invoker.java:1231) at org.testng.internal.TestMethodWorker.invokeTestMethods(TestMethodWorker.java:127) at org.testng.internal.TestMethodWorker.run(TestMethodWorker.java:111) at org.testng.TestRunner.privateRun(TestRunner.java:767) at org.testng.TestRunner.run(TestRunner.java:617) at org.testng.SuiteRunner.runTest(SuiteRunner.java:334) at org.testng.SuiteRunner.runSequentially(SuiteRunner.java:329) at org.testng.SuiteRunner.privateRun(SuiteRunner.java:291) at org.testng.SuiteRunner.run(SuiteRunner.java:240) at org.testng.SuiteRunnerWorker.runSuite(SuiteRunnerWorker.java:52) at org.testng.SuiteRunnerWorker.run(SuiteRunnerWorker.java:86) at org.testng.TestNG.runSuitesSequentially(TestNG.java:1198) at org.testng.TestNG.runSuitesSequentially(TestNG.java:1194) at org.testng.TestNG.runSuitesLocally(TestNG.java:1123) at org.testng.TestNG.run(TestNG.java:1031) at org.apache.maven.surefire.testng.TestNGExecutor.run(TestNGExecutor.java:178) at org.apache.maven.surefire.testng.TestNGXmlTestSuite.execute(TestNGXmlTestSuite.java:92) at org.apache.maven.surefire.testng.TestNGProvider.invoke(TestNGProvider.java:96) at sun.reflect.NativeMethodAccessorImpl.invoke0(Native Method) at sun.reflect.NativeMethodAccessorImpl.invoke(NativeMethodAccessorImpl.java:57) at sun.reflect.DelegatingMethodAccessorImpl.invoke(DelegatingMethodAccessorImpl.java:43) at java.lang.reflect.Method.invoke(Method.java:606) at org.apache.maven.surefire.util.ReflectionUtils.invokeMethodWithArray2(ReflectionUtils.java:208) at org.apache.maven.surefire.booter.ProviderFactory$ProviderProxy.invoke(ProviderFactory.java:158) at org.apache.maven.surefire.booter.ProviderFactory.invokeProvider(ProviderFactory.java:86) at org.apache.maven.surefire.booter.ForkedBooter.runSuitesInProcess(ForkedBooter.java:153) at org.apache.maven.surefire.booter.ForkedBooter.main(ForkedBooter.java:95) "

org.testng.Assert.fail(Assert.java:94)
org.testng.Assert.failNotEquals(Assert.java:494)
org.testng.Assert.assertEquals(Assert.java:123)
org.testng.Assert.assertEquals(Assert.java:165)
at.ac.testing.brooklyn.original.AutoScalerPolicyTest$7.run(AutoScalerPolicyTest.java:608)
java_lang_Runnable$run.call(Unknown Source)
brooklyn.test.TestUtils$_executeUntilSucceeds_closure5.doCall(TestUtils.groovy:148)
sun.reflect.GeneratedMethodAccessor6.invoke(Unknown Source)
sun.reflect.DelegatingMethodAccessorImpl.invoke(DelegatingMethodAccessorImpl.java:43)
java.lang.reflect.Method.invoke(Method.java:606)
org.codehaus.groovy.reflection.CachedMethod.invoke(CachedMethod.java:90)
groovy.lang.MetaMethod.doMethodInvoke(MetaMethod.java:233)
org.codehaus.groovy.runtime.metaclass.ClosureMetaClass.invokeMethod(ClosureMetaClass.java:272)
groovy.lang.MetaClassImpl.invokeMethod(MetaClassImpl.java:877)
org.codehaus.groovy.runtime.callsite.PogoMetaClassSite.callCurrent(PogoMetaClassSite.java:66)
org.codehaus.groovy.runtime.callsite.AbstractCallSite.callCurrent(AbstractCallSite.java:141)
brooklyn.test.TestUtils$_executeUntilSucceeds_closure5.doCall(TestUtils.groovy)
sun.reflect.GeneratedMethodAccessor5.invoke(Unknown Source)
sun.reflect.DelegatingMethodAccessorImpl.invoke(DelegatingMethodAccessorImpl.java:43)
java.lang.reflect.Method.invoke(Method.java:606)
org.codehaus.groovy.reflection.CachedMethod.invoke(CachedMethod.java:90)
groovy.lang.MetaMethod.doMethodInvoke(MetaMethod.java:233)
org.codehaus.groovy.runtime.metaclass.ClosureMetaClass.invokeMethod(ClosureMetaClass.java:272)
groovy.lang.MetaClassImpl.invokeMethod(MetaClassImpl.java:877)
org.codehaus.groovy.runtime.callsite.PogoMetaClassSite.call(PogoMetaClassSite.java:39)
org.codehaus.groovy.runtime.callsite.AbstractCallSite.call(AbstractCallSite.java:112)
brooklyn.test.TestUtils.executeUntilSucceedsWithFinallyBlockInternal(TestUtils.groovy:243)
sun.reflect.GeneratedMethodAccessor35.invoke(Unknown Source)
sun.reflect.DelegatingMethodAccessorImpl.invoke(DelegatingMethodAccessorImpl.java:43)
java.lang.reflect.Method.invoke(Method.java:606)
org.codehaus.groovy.reflection.CachedMethod.invoke(CachedMethod.java:90)
org.codehaus.groovy.runtime.callsite.StaticMetaMethodSite$StaticMetaMethodSiteNoUnwrapNoCoerce.invoke(StaticMetaMethodSite.java:148)
org.codehaus.groovy.runtime.callsite.StaticMetaMethodSite.callStatic(StaticMetaMethodSite.java:99)
org.codehaus.groovy.runtime.callsite.AbstractCallSite.callStatic(AbstractCallSite.java:173)
brooklyn.test.TestUtils.executeUntilSucceedsWithFinallyBlock(TestUtils.groovy:208)
brooklyn.test.TestUtils$executeUntilSucceedsWithFinallyBlock.callStatic(Unknown Source)
brooklyn.test.TestUtils.executeUntilSucceeds(TestUtils.groovy:148)
at.ac.testing.brooklyn.mixed.AutoScalerPolicyTest.testResizeDownStabilizationDelayTakesMinSustainedDesired(AutoScalerPolicyTest.java:437)
sun.reflect.NativeMethodAccessorImpl.invoke0(Native Method)
sun.reflect.NativeMethodAccessorImpl.invoke(NativeMethodAccessorImpl.java:57)
sun.reflect.DelegatingMethodAccessorImpl.invoke(DelegatingMethodAccessorImpl.java:43)
java.lang.reflect.Method.invoke(Method.java:606)
org.testng.internal.MethodInvocationHelper.invokeMethod(MethodInvocationHelper.java:80)
org.testng.internal.Invoker.invokeMethod(Invoker.java:714)
org.testng.internal.Invoker.invokeTestMethod(Invoker.java:901)
org.testng.internal.Invoker.invokeTestMethods(Invoker.java:1231)
org.testng.internal.TestMethodWorker.invokeTestMethods(TestMethodWorker.java:127)
org.testng.internal.TestMethodWorker.run(TestMethodWorker.java:111)
org.testng.TestRunner.privateRun(TestRunner.java:767)
org.testng.TestRunner.run(TestRunner.java:617)
org.testng.SuiteRunner.runTest(SuiteRunner.java:334)
org.testng.SuiteRunner.runSequentially(SuiteRunner.java:329)
org.testng.SuiteRunner.privateRun(SuiteRunner.java:291)
org.testng.SuiteRunner.run(SuiteRunner.java:240)
org.testng.SuiteRunnerWorker.runSuite(SuiteRunnerWorker.java:52)
org.testng.SuiteRunnerWorker.run(SuiteRunnerWorker.java:86)
org.testng.TestNG.runSuitesSequentially(TestNG.java:1198)
org.testng.TestNG.runSuitesSequentially(TestNG.java:1194)
org.testng.TestNG.runSuitesLocally(TestNG.java:1123)
org.testng.TestNG.run(TestNG.java:1031)
org.apache.maven.surefire.testng.TestNGExecutor.run(TestNGExecutor.java:178)
org.apache.maven.surefire.testng.TestNGXmlTestSuite.execute(TestNGXmlTestSuite.java:92)
org.apache.maven.surefire.testng.TestNGProvider.invoke(TestNGProvider.java:96)
sun.reflect.NativeMethodAccessorImpl.invoke0(Native Method)
sun.reflect.NativeMethodAccessorImpl.invoke(NativeMethodAccessorImpl.java:57)
sun.reflect.DelegatingMethodAccessorImpl.invoke(DelegatingMethodAccessorImpl.java:43)
java.lang.reflect.Method.invoke(Method.java:606)
org.apache.maven.surefire.util.ReflectionUtils.invokeMethodWithArray2(ReflectionUtils.java:208)
org.apache.maven.surefire.booter.ProviderFactory$ProviderProxy.invoke(ProviderFactory.java:158)
org.apache.maven.surefire.booter.ProviderFactory.invokeProvider(ProviderFactory.java:86)
org.apache.maven.surefire.booter.ForkedBooter.runSuitesInProcess(ForkedBooter.java:153)
org.apache.maven.surefire.booter.ForkedBooter.main(ForkedBooter.java:95)
at.ac.testing.brooklyn.mixed.AutoScalerPolicyMetricTest
testDecrementsSizeIffLowerBoundExceeded
testDecrementsSizeInProportionToMetric
testIncrementsSizeIffUpperBoundExceeded
testIncrementsSizeInProportionToMetric
testObeysMinAndMaxSize
testWarnsWhenMaxCapReached
at.ac.testing.brooklyn.mixed.AutoScalerPolicyTest
testConcurrentGrowGrow
testConcurrentGrowShrink
testConcurrentShrinkGrow
testConcurrentShrinkShrink
testGrowHotPool
testNeverGrowAboveMaximmum
testNeverGrowColdPool
testNeverShrinkBelowMinimum
testNeverShrinkHotPool
testResizeDownStabilizationDelayIgnoresBlip
testResizeDownStabilizationDelayResizesAfterDelay
testResizeUpStabilizationDelayIgnoresBlip
testResizeUpStabilizationDelayResizesAfterDelay
testResizeUpStabilizationDelayTakesMaxSustainedDesired
testShrinkColdPool
testShrinkColdPoolRoundsUpDesiredNumberOfContainers
at.ac.testing.brooklyn.original.AutoScalerPolicyMetricTest
testDecrementsSizeIffLowerBoundExceeded
testDecrementsSizeInProportionToMetric
testIncrementsSizeIffUpperBoundExceeded
testIncrementsSizeInProportionToMetric
testObeysMinAndMaxSize
testWarnsWhenMaxCapReached
at.ac.testing.brooklyn.original.AutoScalerPolicyTest
testConcurrentGrowGrow
testConcurrentGrowShrink
testConcurrentShrinkGrow
testConcurrentShrinkShrink
testGrowHotPool
testNeverGrowAboveMaximmum
testNeverGrowColdPool
testNeverShrinkBelowMinimum
testNeverShrinkHotPool
testResizeDownStabilizationDelayIgnoresBlip
testResizeDownStabilizationDelayResizesAfterDelay
testResizeDownStabilizationDelayTakesMinSustainedDesired
testResizeUpStabilizationDelayIgnoresBlip
testResizeUpStabilizationDelayResizesAfterDelay
testResizeUpStabilizationDelayTakesMaxSustainedDesired
testShrinkColdPool
testShrinkColdPoolRoundsUpDesiredNumberOfContainers
/Users/alessiogambi/Documents/TUWien/OngoingWorkNotDropBox/icse-companion-site/testsuites/evaluation1/equivalent.xml
<?xml version="1.0" encoding="UTF-8"?>
<!DOCTYPE suite SYSTEM "http://testng.org/testng-1.0.dtd">
<suite verbose="0" name="Equivalent">
  <test name="Equivalent Test Suite">
    <classes>
      <class name="at.ac.testing.brooklyn.equivalent.AutoScalerPolicyTest"/>
      <class name="at.ac.testing.brooklyn.equivalent.AutoScalerPolicyMetricTest"/>
    </classes>
  </test> <!-- Equivalent Test Suite -->
</suite> <!-- Equivalent -->
            
/Users/alessiogambi/Documents/TUWien/OngoingWorkNotDropBox/icse-companion-site/testsuites/evaluation1/scenario.xml
<?xml version="1.0" encoding="UTF-8"?>
<!DOCTYPE suite SYSTEM "http://testng.org/testng-1.0.dtd">
<suite verbose="0" name="Scenario">
  <test name="Scenario Test Suite">
    <classes>
      <class name="at.ac.testing.brooklyn.scenario.AutoScalerPolicyTest"/>
      <class name="at.ac.testing.brooklyn.scenario.AutoScalerPolicyMetricTest"/>
    </classes>
  </test> <!-- Scenario Test Suite -->
</suite> <!-- Scenario -->
            
/Users/alessiogambi/Documents/TUWien/OngoingWorkNotDropBox/icse-companion-site/testsuites/evaluation1/literal.xml
<?xml version="1.0" encoding="UTF-8"?>
<!DOCTYPE suite SYSTEM "http://testng.org/testng-1.0.dtd">
<suite verbose="0" name="Literal">
  <test name="Literal Test Suite">
    <classes>
      <class name="at.ac.testing.brooklyn.literal.AutoScalerPolicyTest"/>
      <class name="at.ac.testing.brooklyn.literal.AutoScalerPolicyMetricTest"/>
    </classes>
  </test> <!-- Literal Test Suite -->
</suite> <!-- Literal -->
            
/Users/alessiogambi/Documents/TUWien/OngoingWorkNotDropBox/icse-companion-site/testsuites/evaluation1/mixed.xml
<?xml version="1.0" encoding="UTF-8"?>
<!DOCTYPE suite SYSTEM "http://testng.org/testng-1.0.dtd">
<suite verbose="0" name="Mixed">
  <test name="Mixed Test Suite">
    <classes>
      <class name="at.ac.testing.brooklyn.mixed.AutoScalerPolicyTest"/>
      <class name="at.ac.testing.brooklyn.mixed.AutoScalerPolicyMetricTest"/>
    </classes>
  </test> <!-- Mixed Test Suite -->
</suite> <!-- Mixed -->
            
/Users/alessiogambi/Documents/TUWien/OngoingWorkNotDropBox/icse-companion-site/testsuites/evaluation1/original.xml
<?xml version="1.0" encoding="UTF-8"?>
<!DOCTYPE suite SYSTEM "http://testng.org/testng-1.0.dtd">
<suite verbose="0" name="Original">
  <test name="Original Test Suite">
    <classes>
      <class name="at.ac.testing.brooklyn.original.AutoScalerPolicyTest"/>
      <class name="at.ac.testing.brooklyn.original.AutoScalerPolicyMetricTest"/>
    </classes>
  </test> <!-- Original Test Suite -->
</suite> <!-- Original -->
            
/Users/alessiogambi/Documents/TUWien/OngoingWorkNotDropBox/icse-companion-site/testsuites/evaluation-1.xml
<?xml version="1.0" encoding="UTF-8"?>
<!DOCTYPE suite SYSTEM "http://testng.org/testng-1.0.dtd">
<suite verbose="0" name="ICSE 2015 - Evaluation 1">
  <suite-files>
    <suite-file path="testsuites/evaluation1/original.xml"/>
    <suite-file path="testsuites/evaluation1/literal.xml"/>
    <suite-file path="testsuites/evaluation1/equivalent.xml"/>
    <suite-file path="testsuites/evaluation1/scenario.xml"/>
    <suite-file path="testsuites/evaluation1/mixed.xml"/>
  </suite-files>
</suite> <!-- ICSE 2015 - Evaluation 1 -->
            
Tests for Equivalent
  • Equivalent Test Suite (2 classes)
Tests for Scenario
  • Scenario Test Suite (2 classes)
Tests for Literal
  • Literal Test Suite (2 classes)
Tests for Mixed
  • Mixed Test Suite (2 classes)
Tests for Original
  • Original Test Suite (2 classes)
Tests for ICSE 2015 - Evaluation 1
Groups for Equivalent
Integration
testConcurrentGrowGrow
testConcurrentGrowShrink
testConcurrentShrinkGrow
testConcurrentShrinkShrink
testResizeDownStabilizationDelayIgnoresBlip
testResizeDownStabilizationDelayResizesAfterDelay
testResizeDownStabilizationDelayTakesMinSustainedDesired
testResizeUpStabilizationDelayIgnoresBlip
testResizeUpStabilizationDelayResizesAfterDelay
testResizeUpStabilizationDelayTakesMaxSustainedDesired
Groups for Scenario
Integration
testConcurrentGrowGrow
testConcurrentGrowShrink
testConcurrentShrinkGrow
testConcurrentShrinkShrink
testResizeDownStabilizationDelayIgnoresBlip
testResizeDownStabilizationDelayResizesAfterDelay
testResizeDownStabilizationDelayTakesMinSustainedDesired
testResizeUpStabilizationDelayIgnoresBlip
testResizeUpStabilizationDelayResizesAfterDelay
testResizeUpStabilizationDelayTakesMaxSustainedDesired
Groups for Literal
Integration
testConcurrentGrowGrow
testConcurrentGrowShrink
testConcurrentShrinkGrow
testConcurrentShrinkShrink
testResizeDownStabilizationDelayIgnoresBlip
testResizeDownStabilizationDelayResizesAfterDelay
testResizeDownStabilizationDelayTakesMinSustainedDesired
testResizeUpStabilizationDelayIgnoresBlip
testResizeUpStabilizationDelayResizesAfterDelay
testResizeUpStabilizationDelayTakesMaxSustainedDesired
Groups for Mixed
Integration
testConcurrentGrowGrow
testConcurrentGrowShrink
testConcurrentShrinkGrow
testConcurrentShrinkShrink
testResizeDownStabilizationDelayIgnoresBlip
testResizeDownStabilizationDelayResizesAfterDelay
testResizeDownStabilizationDelayTakesMinSustainedDesired
testResizeUpStabilizationDelayIgnoresBlip
testResizeUpStabilizationDelayResizesAfterDelay
testResizeUpStabilizationDelayTakesMaxSustainedDesired
Groups for Original
Integration
testConcurrentGrowGrow
testConcurrentGrowShrink
testConcurrentShrinkGrow
testConcurrentShrinkShrink
testResizeDownStabilizationDelayIgnoresBlip
testResizeDownStabilizationDelayResizesAfterDelay
testResizeDownStabilizationDelayTakesMinSustainedDesired
testResizeUpStabilizationDelayIgnoresBlip
testResizeUpStabilizationDelayResizesAfterDelay
testResizeUpStabilizationDelayTakesMaxSustainedDesired
Groups for ICSE 2015 - Evaluation 1
Times for Equivalent
Total running time: 44 seconds
Times for Scenario
Total running time: 8 minutes
Times for Literal
Total running time: 32 seconds
Times for Mixed
Total running time: 5 minutes
Times for Original
Total running time: 14 seconds
Times for ICSE 2015 - Evaluation 1
Reporter output for Equivalent
Reporter output for Scenario
Reporter output for Literal
Reporter output for Mixed
Reporter output for Original
Reporter output for ICSE 2015 - Evaluation 1
0 ignored methods
0 ignored methods
0 ignored methods
0 ignored methods
0 ignored methods
0 ignored methods
Methods in chronological order
at.ac.testing.brooklyn.original.AutoScalerPolicyTest
setUp 0 ms
testConcurrentGrowGrow 242 ms
tearDown 820 ms
setUp 918 ms
testConcurrentGrowShrink 937 ms
tearDown 1714 ms
setUp 1778 ms
testConcurrentShrinkGrow 1797 ms
tearDown 2571 ms
setUp 2657 ms
testConcurrentShrinkShrink 2678 ms
tearDown 3450 ms
setUp 3537 ms
testGrowHotPool 3553 ms
tearDown 3557 ms
setUp 3597 ms
testNeverGrowAboveMaximmum 3614 ms
tearDown 3622 ms
setUp 3688 ms
testNeverGrowColdPool 3704 ms
tearDown 3957 ms
setUp 3998 ms
testNeverShrinkBelowMinimum 4015 ms
tearDown 4021 ms
setUp 4073 ms
testNeverShrinkHotPool 4087 ms
tearDown 4339 ms
setUp 4372 ms
testResizeDownStabilizationDelayIgnoresBlip 4386 ms
tearDown 5909 ms
setUp 5983 ms
testResizeDownStabilizationDelayResizesAfterDelay 5997 ms
tearDown 7023 ms
setUp 7089 ms
testResizeDownStabilizationDelayTakesMinSustainedDesired 7101 ms
tearDown 8806 ms
setUp 8838 ms
testResizeUpStabilizationDelayIgnoresBlip 8850 ms
tearDown 10359 ms
setUp 10393 ms
testResizeUpStabilizationDelayResizesAfterDelay 10404 ms
tearDown 11428 ms
setUp 11463 ms
testResizeUpStabilizationDelayTakesMaxSustainedDesired 11474 ms
tearDown 13179 ms
setUp 13249 ms
testShrinkColdPool 13261 ms
tearDown 13264 ms
setUp 13337 ms
testShrinkColdPoolRoundsUpDesiredNumberOfContainers 13348 ms
tearDown 13351 ms
at.ac.testing.brooklyn.original.AutoScalerPolicyMetricTest
before 13414 ms
testDecrementsSizeIffLowerBoundExceeded 13421 ms
tearDown 13688 ms
before 13774 ms
testDecrementsSizeInProportionToMetric 13781 ms
tearDown 13991 ms
before 14027 ms
testIncrementsSizeIffUpperBoundExceeded 14034 ms
tearDown 14296 ms
before 14330 ms
testIncrementsSizeInProportionToMetric 14338 ms
tearDown 14476 ms
before 14512 ms
testObeysMinAndMaxSize 14519 ms
tearDown 14658 ms
before 14691 ms
testWarnsWhenMaxCapReached 14698 ms
tearDown 15850 ms
at.ac.testing.brooklyn.literal.AutoScalerPolicyTest
setUpSolver 15916 ms
setUp 15922 ms
testConcurrentGrowGrow 15934 ms
tearDown 18686 ms
setUp 18780 ms
testConcurrentGrowShrink 18791 ms
tearDown 20515 ms
setUp 20558 ms
testConcurrentShrinkGrow 20569 ms
tearDown 22272 ms
setUp 22308 ms
testConcurrentShrinkShrink 22319 ms
tearDown 24055 ms
setUp 24088 ms
testGrowHotPool 24098 ms
tearDown 24680 ms
setUp 24713 ms
testNeverGrowAboveMaximmum 24723 ms
tearDown 24728 ms
setUp 24762 ms
testNeverGrowColdPool 24771 ms
tearDown 25604 ms
setUp 25651 ms
testNeverShrinkBelowMinimum 25661 ms
tearDown 26243 ms
setUp 26280 ms
testNeverShrinkHotPool 26288 ms
tearDown 27138 ms
setUp 27176 ms
testResizeDownStabilizationDelayIgnoresBlip 27185 ms
tearDown 28865 ms
setUp 28916 ms
testResizeDownStabilizationDelayResizesAfterDelay 28924 ms
tearDown 30518 ms
setUp 30577 ms
testResizeDownStabilizationDelayTakesMinSustainedDesired 30585 ms
tearDown 32925 ms
setUp 32959 ms
testResizeUpStabilizationDelayIgnoresBlip 32968 ms
tearDown 34631 ms
setUp 34671 ms
testResizeUpStabilizationDelayResizesAfterDelay 34678 ms
tearDown 36269 ms
setUp 36306 ms
testResizeUpStabilizationDelayTakesMaxSustainedDesired 36314 ms
tearDown 38666 ms
setUp 38699 ms
testShrinkColdPool 38706 ms
tearDown 39274 ms
setUp 39314 ms
testShrinkColdPoolRoundsUpDesiredNumberOfContainers 39321 ms
tearDown 39885 ms
at.ac.testing.brooklyn.literal.AutoScalerPolicyMetricTest
before 39919 ms
setUpSolver 39919 ms
testDecrementsSizeIffLowerBoundExceeded 39925 ms
tearDown 41311 ms
before 41373 ms
testDecrementsSizeInProportionToMetric 41379 ms
tearDown 43086 ms
before 43124 ms
testIncrementsSizeIffUpperBoundExceeded 43129 ms
tearDown 44538 ms
before 44576 ms
testIncrementsSizeInProportionToMetric 44581 ms
tearDown 45755 ms
before 45788 ms
testObeysMinAndMaxSize 45794 ms
tearDown 46945 ms
before 46979 ms
testWarnsWhenMaxCapReached 46985 ms
tearDown 49172 ms
at.ac.testing.brooklyn.equivalent.AutoScalerPolicyTest
setUp 49228 ms
setUpSolver 49228 ms
testConcurrentGrowGrow 49236 ms
tearDown 51139 ms
setUp 51193 ms
testConcurrentGrowShrink 51200 ms
tearDown 53114 ms
setUp 53154 ms
testConcurrentShrinkGrow 53161 ms
tearDown 55122 ms
setUp 55159 ms
testConcurrentShrinkShrink 55166 ms
tearDown 57063 ms
setUp 57101 ms
testGrowHotPool 57108 ms
tearDown 57669 ms
setUp 57701 ms
testNeverGrowAboveMaximmum 57710 ms
tearDown 58278 ms
setUp 58309 ms
testNeverGrowColdPool 58316 ms
tearDown 59135 ms
setUp 59170 ms
testNeverShrinkBelowMinimum 59177 ms
tearDown 59780 ms
setUp 59818 ms
testNeverShrinkHotPool 59825 ms
tearDown 60665 ms
setUp 60704 ms
testResizeDownStabilizationDelayIgnoresBlip 60711 ms
tearDown 63447 ms
setUp 63490 ms
testResizeDownStabilizationDelayResizesAfterDelay 63498 ms
tearDown 65131 ms
setUp 65171 ms
testResizeDownStabilizationDelayTakesMinSustainedDesired 65178 ms
tearDown 77481 ms
setUp 77542 ms
testResizeUpStabilizationDelayIgnoresBlip 77549 ms
tearDown 80201 ms
setUp 80238 ms
testResizeUpStabilizationDelayResizesAfterDelay 80246 ms
tearDown 81845 ms
setUp 81899 ms
testResizeUpStabilizationDelayTakesMaxSustainedDesired 81909 ms
tearDown 84785 ms
setUp 84821 ms
testShrinkColdPool 84828 ms
tearDown 85421 ms
setUp 85459 ms
testShrinkColdPoolRoundsUpDesiredNumberOfContainers 85468 ms
tearDown 86071 ms
at.ac.testing.brooklyn.equivalent.AutoScalerPolicyMetricTest
before 86108 ms
setUpSolver 86108 ms
testDecrementsSizeIffLowerBoundExceeded 86114 ms
tearDown 87496 ms
before 87529 ms
testDecrementsSizeInProportionToMetric 87535 ms
tearDown 89245 ms
before 89281 ms
testIncrementsSizeIffUpperBoundExceeded 89286 ms
tearDown 90694 ms
before 90730 ms
testIncrementsSizeInProportionToMetric 90737 ms
tearDown 91854 ms
before 91894 ms
testObeysMinAndMaxSize 91900 ms
tearDown 93031 ms
before 93070 ms
testWarnsWhenMaxCapReached 93077 ms
tearDown 95218 ms
at.ac.testing.brooklyn.scenario.AutoScalerPolicyTest
setUp 95277 ms
setUpSolver 95277 ms
testConcurrentGrowGrow 95285 ms
forceGC 125324 ms
tearDown 125401 ms
setUp 125443 ms
testConcurrentGrowShrink 125452 ms
forceGC 156055 ms
tearDown 156093 ms
setUp 156132 ms
testConcurrentShrinkGrow 156141 ms
forceGC 187124 ms
tearDown 187162 ms
setUp 187202 ms
testConcurrentShrinkShrink 187211 ms
forceGC 216259 ms
tearDown 216296 ms
setUp 216334 ms
testGrowHotPool 216341 ms
forceGC 225476 ms
tearDown 225514 ms
setUp 225554 ms
testNeverGrowAboveMaximmum 225568 ms
forceGC 234665 ms
tearDown 234699 ms
setUp 234736 ms
testNeverGrowColdPool 234744 ms
forceGC 243769 ms
tearDown 243810 ms
setUp 243846 ms
testNeverShrinkBelowMinimum 243855 ms
forceGC 253453 ms
tearDown 253489 ms
setUp 253527 ms
testNeverShrinkHotPool 253537 ms
forceGC 262696 ms
tearDown 262734 ms
setUp 262773 ms
testResizeDownStabilizationDelayIgnoresBlip 262783 ms
forceGC 288563 ms
tearDown 288604 ms
setUp 288641 ms
testResizeDownStabilizationDelayResizesAfterDelay 288649 ms
forceGC 310949 ms
tearDown 310985 ms
setUp 311022 ms
testResizeDownStabilizationDelayTakesMinSustainedDesired 311031 ms
forceGC 364985 ms
tearDown 365020 ms
setUp 365058 ms
testResizeUpStabilizationDelayIgnoresBlip 365067 ms
forceGC 392461 ms
tearDown 392494 ms
setUp 392535 ms
testResizeUpStabilizationDelayResizesAfterDelay 392543 ms
forceGC 414391 ms
tearDown 414437 ms
setUp 414473 ms
testResizeUpStabilizationDelayTakesMaxSustainedDesired 414481 ms
forceGC 458468 ms
tearDown 458526 ms
setUp 458569 ms
testShrinkColdPool 458576 ms
forceGC 467666 ms
tearDown 467704 ms
setUp 467740 ms
testShrinkColdPoolRoundsUpDesiredNumberOfContainers 467749 ms
forceGC 476864 ms
tearDown 476900 ms
at.ac.testing.brooklyn.scenario.AutoScalerPolicyMetricTest
before 476936 ms
setUpSolver 476936 ms
testDecrementsSizeIffLowerBoundExceeded 476941 ms
tearDown 498826 ms
before 498886 ms
testDecrementsSizeInProportionToMetric 498891 ms
tearDown 535963 ms
before 536020 ms
testIncrementsSizeIffUpperBoundExceeded 536025 ms
tearDown 558337 ms
before 558374 ms
testIncrementsSizeInProportionToMetric 558379 ms
tearDown 581633 ms
before 581678 ms
testObeysMinAndMaxSize 581682 ms
tearDown 603709 ms
before 603751 ms
testWarnsWhenMaxCapReached 603756 ms
tearDown 626582 ms
at.ac.testing.brooklyn.mixed.AutoScalerPolicyTest
setUp 626631 ms
setUpSolver 626631 ms
testConcurrentGrowGrow 626637 ms
forceGC 654993 ms
tearDown 655050 ms
setUp 655096 ms
testConcurrentGrowShrink 655103 ms
forceGC 684383 ms
tearDown 684422 ms
setUp 684458 ms
testConcurrentShrinkGrow 684465 ms
forceGC 712867 ms
tearDown 712903 ms
setUp 712943 ms
testConcurrentShrinkShrink 712951 ms
forceGC 742004 ms
tearDown 742041 ms
setUp 742081 ms
testGrowHotPool 742087 ms
forceGC 742668 ms
tearDown 742700 ms
setUp 742737 ms
testNeverGrowAboveMaximmum 742745 ms
forceGC 752011 ms
tearDown 752051 ms
setUp 752090 ms
testNeverGrowColdPool 752098 ms
forceGC 752960 ms
tearDown 752994 ms
setUp 753037 ms
testNeverShrinkBelowMinimum 753044 ms
forceGC 762899 ms
tearDown 762934 ms
setUp 762968 ms
testNeverShrinkHotPool 762976 ms
forceGC 763823 ms
tearDown 763857 ms
setUp 763896 ms
testResizeDownStabilizationDelayIgnoresBlip 763905 ms
forceGC 789638 ms
tearDown 789677 ms
setUp 789735 ms
testResizeDownStabilizationDelayResizesAfterDelay 789744 ms
forceGC 791333 ms
tearDown 791368 ms
setUp 791409 ms
testResizeDownStabilizationDelayTakesMinSustainedDesired 791417 ms
forceGC 845755 ms
tearDown 845793 ms
setUp 845833 ms
testResizeUpStabilizationDelayIgnoresBlip 845841 ms
forceGC 872653 ms
tearDown 872688 ms
setUp 872726 ms
testResizeUpStabilizationDelayResizesAfterDelay 872735 ms
forceGC 874358 ms
tearDown 874394 ms
setUp 874437 ms
testResizeUpStabilizationDelayTakesMaxSustainedDesired 874444 ms
forceGC 918832 ms
tearDown 918867 ms
setUp 918908 ms
testShrinkColdPool 918914 ms
forceGC 919496 ms
tearDown 919529 ms
setUp 919569 ms
testShrinkColdPoolRoundsUpDesiredNumberOfContainers 919578 ms
forceGC 920169 ms
tearDown 920202 ms
at.ac.testing.brooklyn.mixed.AutoScalerPolicyMetricTest
setUpSolver 920242 ms
before 920243 ms
testDecrementsSizeIffLowerBoundExceeded 920248 ms
tearDown 921654 ms
before 921691 ms
testDecrementsSizeInProportionToMetric 921695 ms
tearDown 923378 ms
before 923413 ms
testIncrementsSizeIffUpperBoundExceeded 923418 ms
tearDown 924818 ms
before 924855 ms
testIncrementsSizeInProportionToMetric 924860 ms
tearDown 925985 ms
before 926026 ms
testObeysMinAndMaxSize 926032 ms
tearDown 948351 ms
before 948393 ms
testWarnsWhenMaxCapReached 948398 ms
tearDown 971277 ms
Methods in chronological order
at.ac.testing.brooklyn.original.AutoScalerPolicyTest
setUp 0 ms
testConcurrentGrowGrow 242 ms
tearDown 820 ms
setUp 918 ms
testConcurrentGrowShrink 937 ms
tearDown 1714 ms
setUp 1778 ms
testConcurrentShrinkGrow 1797 ms
tearDown 2571 ms
setUp 2657 ms
testConcurrentShrinkShrink 2678 ms
tearDown 3450 ms
setUp 3537 ms
testGrowHotPool 3553 ms
tearDown 3557 ms
setUp 3597 ms
testNeverGrowAboveMaximmum 3614 ms
tearDown 3622 ms
setUp 3688 ms
testNeverGrowColdPool 3704 ms
tearDown 3957 ms
setUp 3998 ms
testNeverShrinkBelowMinimum 4015 ms
tearDown 4021 ms
setUp 4073 ms
testNeverShrinkHotPool 4087 ms
tearDown 4339 ms
setUp 4372 ms
testResizeDownStabilizationDelayIgnoresBlip 4386 ms
tearDown 5909 ms
setUp 5983 ms
testResizeDownStabilizationDelayResizesAfterDelay 5997 ms
tearDown 7023 ms
setUp 7089 ms
testResizeDownStabilizationDelayTakesMinSustainedDesired 7101 ms
tearDown 8806 ms
setUp 8838 ms
testResizeUpStabilizationDelayIgnoresBlip 8850 ms
tearDown 10359 ms
setUp 10393 ms
testResizeUpStabilizationDelayResizesAfterDelay 10404 ms
tearDown 11428 ms
setUp 11463 ms
testResizeUpStabilizationDelayTakesMaxSustainedDesired 11474 ms
tearDown 13179 ms
setUp 13249 ms
testShrinkColdPool 13261 ms
tearDown 13264 ms
setUp 13337 ms
testShrinkColdPoolRoundsUpDesiredNumberOfContainers 13348 ms
tearDown 13351 ms
at.ac.testing.brooklyn.original.AutoScalerPolicyMetricTest
before 13414 ms
testDecrementsSizeIffLowerBoundExceeded 13421 ms
tearDown 13688 ms
before 13774 ms
testDecrementsSizeInProportionToMetric 13781 ms
tearDown 13991 ms
before 14027 ms
testIncrementsSizeIffUpperBoundExceeded 14034 ms
tearDown 14296 ms
before 14330 ms
testIncrementsSizeInProportionToMetric 14338 ms
tearDown 14476 ms
before 14512 ms
testObeysMinAndMaxSize 14519 ms
tearDown 14658 ms
before 14691 ms
testWarnsWhenMaxCapReached 14698 ms
tearDown 15850 ms
at.ac.testing.brooklyn.literal.AutoScalerPolicyTest
setUpSolver 15916 ms
setUp 15922 ms
testConcurrentGrowGrow 15934 ms
tearDown 18686 ms
setUp 18780 ms
testConcurrentGrowShrink 18791 ms
tearDown 20515 ms
setUp 20558 ms
testConcurrentShrinkGrow 20569 ms
tearDown 22272 ms
setUp 22308 ms
testConcurrentShrinkShrink 22319 ms
tearDown 24055 ms
setUp 24088 ms
testGrowHotPool 24098 ms
tearDown 24680 ms
setUp 24713 ms
testNeverGrowAboveMaximmum 24723 ms
tearDown 24728 ms
setUp 24762 ms
testNeverGrowColdPool 24771 ms
tearDown 25604 ms
setUp 25651 ms
testNeverShrinkBelowMinimum 25661 ms
tearDown 26243 ms
setUp 26280 ms
testNeverShrinkHotPool 26288 ms
tearDown 27138 ms
setUp 27176 ms
testResizeDownStabilizationDelayIgnoresBlip 27185 ms
tearDown 28865 ms
setUp 28916 ms
testResizeDownStabilizationDelayResizesAfterDelay 28924 ms
tearDown 30518 ms
setUp 30577 ms
testResizeDownStabilizationDelayTakesMinSustainedDesired 30585 ms
tearDown 32925 ms
setUp 32959 ms
testResizeUpStabilizationDelayIgnoresBlip 32968 ms
tearDown 34631 ms
setUp 34671 ms
testResizeUpStabilizationDelayResizesAfterDelay 34678 ms
tearDown 36269 ms
setUp 36306 ms
testResizeUpStabilizationDelayTakesMaxSustainedDesired 36314 ms
tearDown 38666 ms
setUp 38699 ms
testShrinkColdPool 38706 ms
tearDown 39274 ms
setUp 39314 ms
testShrinkColdPoolRoundsUpDesiredNumberOfContainers 39321 ms
tearDown 39885 ms
at.ac.testing.brooklyn.literal.AutoScalerPolicyMetricTest
before 39919 ms
setUpSolver 39919 ms
testDecrementsSizeIffLowerBoundExceeded 39925 ms
tearDown 41311 ms
before 41373 ms
testDecrementsSizeInProportionToMetric 41379 ms
tearDown 43086 ms
before 43124 ms
testIncrementsSizeIffUpperBoundExceeded 43129 ms
tearDown 44538 ms
before 44576 ms
testIncrementsSizeInProportionToMetric 44581 ms
tearDown 45755 ms
before 45788 ms
testObeysMinAndMaxSize 45794 ms
tearDown 46945 ms
before 46979 ms
testWarnsWhenMaxCapReached 46985 ms
tearDown 49172 ms
at.ac.testing.brooklyn.equivalent.AutoScalerPolicyTest
setUp 49228 ms
setUpSolver 49228 ms
testConcurrentGrowGrow 49236 ms
tearDown 51139 ms
setUp 51193 ms
testConcurrentGrowShrink 51200 ms
tearDown 53114 ms
setUp 53154 ms
testConcurrentShrinkGrow 53161 ms
tearDown 55122 ms
setUp 55159 ms
testConcurrentShrinkShrink 55166 ms
tearDown 57063 ms
setUp 57101 ms
testGrowHotPool 57108 ms
tearDown 57669 ms
setUp 57701 ms
testNeverGrowAboveMaximmum 57710 ms
tearDown 58278 ms
setUp 58309 ms
testNeverGrowColdPool 58316 ms
tearDown 59135 ms
setUp 59170 ms
testNeverShrinkBelowMinimum 59177 ms
tearDown 59780 ms
setUp 59818 ms
testNeverShrinkHotPool 59825 ms
tearDown 60665 ms
setUp 60704 ms
testResizeDownStabilizationDelayIgnoresBlip 60711 ms
tearDown 63447 ms
setUp 63490 ms
testResizeDownStabilizationDelayResizesAfterDelay 63498 ms
tearDown 65131 ms
setUp 65171 ms
testResizeDownStabilizationDelayTakesMinSustainedDesired 65178 ms
tearDown 77481 ms
setUp 77542 ms
testResizeUpStabilizationDelayIgnoresBlip 77549 ms
tearDown 80201 ms
setUp 80238 ms
testResizeUpStabilizationDelayResizesAfterDelay 80246 ms
tearDown 81845 ms
setUp 81899 ms
testResizeUpStabilizationDelayTakesMaxSustainedDesired 81909 ms
tearDown 84785 ms
setUp 84821 ms
testShrinkColdPool 84828 ms
tearDown 85421 ms
setUp 85459 ms
testShrinkColdPoolRoundsUpDesiredNumberOfContainers 85468 ms
tearDown 86071 ms
at.ac.testing.brooklyn.equivalent.AutoScalerPolicyMetricTest
before 86108 ms
setUpSolver 86108 ms
testDecrementsSizeIffLowerBoundExceeded 86114 ms
tearDown 87496 ms
before 87529 ms
testDecrementsSizeInProportionToMetric 87535 ms
tearDown 89245 ms
before 89281 ms
testIncrementsSizeIffUpperBoundExceeded 89286 ms
tearDown 90694 ms
before 90730 ms
testIncrementsSizeInProportionToMetric 90737 ms
tearDown 91854 ms
before 91894 ms
testObeysMinAndMaxSize 91900 ms
tearDown 93031 ms
before 93070 ms
testWarnsWhenMaxCapReached 93077 ms
tearDown 95218 ms
at.ac.testing.brooklyn.scenario.AutoScalerPolicyTest
setUp 95277 ms
setUpSolver 95277 ms
testConcurrentGrowGrow 95285 ms
forceGC 125324 ms
tearDown 125401 ms
setUp 125443 ms
testConcurrentGrowShrink 125452 ms
forceGC 156055 ms
tearDown 156093 ms
setUp 156132 ms
testConcurrentShrinkGrow 156141 ms
forceGC 187124 ms
tearDown 187162 ms
setUp 187202 ms
testConcurrentShrinkShrink 187211 ms
forceGC 216259 ms
tearDown 216296 ms
setUp 216334 ms
testGrowHotPool 216341 ms
forceGC 225476 ms
tearDown 225514 ms
setUp 225554 ms
testNeverGrowAboveMaximmum 225568 ms
forceGC 234665 ms
tearDown 234699 ms
setUp 234736 ms
testNeverGrowColdPool 234744 ms
forceGC 243769 ms
tearDown 243810 ms
setUp 243846 ms
testNeverShrinkBelowMinimum 243855 ms
forceGC 253453 ms
tearDown 253489 ms
setUp 253527 ms
testNeverShrinkHotPool 253537 ms
forceGC 262696 ms
tearDown 262734 ms
setUp 262773 ms
testResizeDownStabilizationDelayIgnoresBlip 262783 ms
forceGC 288563 ms
tearDown 288604 ms
setUp 288641 ms
testResizeDownStabilizationDelayResizesAfterDelay 288649 ms
forceGC 310949 ms
tearDown 310985 ms
setUp 311022 ms
testResizeDownStabilizationDelayTakesMinSustainedDesired 311031 ms
forceGC 364985 ms
tearDown 365020 ms
setUp 365058 ms
testResizeUpStabilizationDelayIgnoresBlip 365067 ms
forceGC 392461 ms
tearDown 392494 ms
setUp 392535 ms
testResizeUpStabilizationDelayResizesAfterDelay 392543 ms
forceGC 414391 ms
tearDown 414437 ms
setUp 414473 ms
testResizeUpStabilizationDelayTakesMaxSustainedDesired 414481 ms
forceGC 458468 ms
tearDown 458526 ms
setUp 458569 ms
testShrinkColdPool 458576 ms
forceGC 467666 ms
tearDown 467704 ms
setUp 467740 ms
testShrinkColdPoolRoundsUpDesiredNumberOfContainers 467749 ms
forceGC 476864 ms
tearDown 476900 ms
at.ac.testing.brooklyn.scenario.AutoScalerPolicyMetricTest
before 476936 ms
setUpSolver 476936 ms
testDecrementsSizeIffLowerBoundExceeded 476941 ms
tearDown 498826 ms
before 498886 ms
testDecrementsSizeInProportionToMetric 498891 ms
tearDown 535963 ms
before 536020 ms
testIncrementsSizeIffUpperBoundExceeded 536025 ms
tearDown 558337 ms
before 558374 ms
testIncrementsSizeInProportionToMetric 558379 ms
tearDown 581633 ms
before 581678 ms
testObeysMinAndMaxSize 581682 ms
tearDown 603709 ms
before 603751 ms
testWarnsWhenMaxCapReached 603756 ms
tearDown 626582 ms
at.ac.testing.brooklyn.mixed.AutoScalerPolicyTest
setUp 626631 ms
setUpSolver 626631 ms
testConcurrentGrowGrow 626637 ms
forceGC 654993 ms
tearDown 655050 ms
setUp 655096 ms
testConcurrentGrowShrink 655103 ms
forceGC 684383 ms
tearDown 684422 ms
setUp 684458 ms
testConcurrentShrinkGrow 684465 ms
forceGC 712867 ms
tearDown 712903 ms
setUp 712943 ms
testConcurrentShrinkShrink 712951 ms
forceGC 742004 ms
tearDown 742041 ms
setUp 742081 ms
testGrowHotPool 742087 ms
forceGC 742668 ms
tearDown 742700 ms
setUp 742737 ms
testNeverGrowAboveMaximmum 742745 ms
forceGC 752011 ms
tearDown 752051 ms
setUp 752090 ms
testNeverGrowColdPool 752098 ms
forceGC 752960 ms
tearDown 752994 ms
setUp 753037 ms
testNeverShrinkBelowMinimum 753044 ms
forceGC 762899 ms
tearDown 762934 ms
setUp 762968 ms
testNeverShrinkHotPool 762976 ms
forceGC 763823 ms
tearDown 763857 ms
setUp 763896 ms
testResizeDownStabilizationDelayIgnoresBlip 763905 ms
forceGC 789638 ms
tearDown 789677 ms
setUp 789735 ms
testResizeDownStabilizationDelayResizesAfterDelay 789744 ms
forceGC 791333 ms
tearDown 791368 ms
setUp 791409 ms
testResizeDownStabilizationDelayTakesMinSustainedDesired 791417 ms
forceGC 845755 ms
tearDown 845793 ms
setUp 845833 ms
testResizeUpStabilizationDelayIgnoresBlip 845841 ms
forceGC 872653 ms
tearDown 872688 ms
setUp 872726 ms
testResizeUpStabilizationDelayResizesAfterDelay 872735 ms
forceGC 874358 ms
tearDown 874394 ms
setUp 874437 ms
testResizeUpStabilizationDelayTakesMaxSustainedDesired 874444 ms
forceGC 918832 ms
tearDown 918867 ms
setUp 918908 ms
testShrinkColdPool 918914 ms
forceGC 919496 ms
tearDown 919529 ms
setUp 919569 ms
testShrinkColdPoolRoundsUpDesiredNumberOfContainers 919578 ms
forceGC 920169 ms
tearDown 920202 ms
at.ac.testing.brooklyn.mixed.AutoScalerPolicyMetricTest
setUpSolver 920242 ms
before 920243 ms
testDecrementsSizeIffLowerBoundExceeded 920248 ms
tearDown 921654 ms
before 921691 ms
testDecrementsSizeInProportionToMetric 921695 ms
tearDown 923378 ms
before 923413 ms
testIncrementsSizeIffUpperBoundExceeded 923418 ms
tearDown 924818 ms
before 924855 ms
testIncrementsSizeInProportionToMetric 924860 ms
tearDown 925985 ms
before 926026 ms
testObeysMinAndMaxSize 926032 ms
tearDown 948351 ms
before 948393 ms
testWarnsWhenMaxCapReached 948398 ms
tearDown 971277 ms
Methods in chronological order
at.ac.testing.brooklyn.original.AutoScalerPolicyTest
setUp 0 ms
testConcurrentGrowGrow 242 ms
tearDown 820 ms
setUp 918 ms
testConcurrentGrowShrink 937 ms
tearDown 1714 ms
setUp 1778 ms
testConcurrentShrinkGrow 1797 ms
tearDown 2571 ms
setUp 2657 ms
testConcurrentShrinkShrink 2678 ms
tearDown 3450 ms
setUp 3537 ms
testGrowHotPool 3553 ms
tearDown 3557 ms
setUp 3597 ms
testNeverGrowAboveMaximmum 3614 ms
tearDown 3622 ms
setUp 3688 ms
testNeverGrowColdPool 3704 ms
tearDown 3957 ms
setUp 3998 ms
testNeverShrinkBelowMinimum 4015 ms
tearDown 4021 ms
setUp 4073 ms
testNeverShrinkHotPool 4087 ms
tearDown 4339 ms
setUp 4372 ms
testResizeDownStabilizationDelayIgnoresBlip 4386 ms
tearDown 5909 ms
setUp 5983 ms
testResizeDownStabilizationDelayResizesAfterDelay 5997 ms
tearDown 7023 ms
setUp 7089 ms
testResizeDownStabilizationDelayTakesMinSustainedDesired 7101 ms
tearDown 8806 ms
setUp 8838 ms
testResizeUpStabilizationDelayIgnoresBlip 8850 ms
tearDown 10359 ms
setUp 10393 ms
testResizeUpStabilizationDelayResizesAfterDelay 10404 ms
tearDown 11428 ms
setUp 11463 ms
testResizeUpStabilizationDelayTakesMaxSustainedDesired 11474 ms
tearDown 13179 ms
setUp 13249 ms
testShrinkColdPool 13261 ms
tearDown 13264 ms
setUp 13337 ms
testShrinkColdPoolRoundsUpDesiredNumberOfContainers 13348 ms
tearDown 13351 ms
at.ac.testing.brooklyn.original.AutoScalerPolicyMetricTest
before 13414 ms
testDecrementsSizeIffLowerBoundExceeded 13421 ms
tearDown 13688 ms
before 13774 ms
testDecrementsSizeInProportionToMetric 13781 ms
tearDown 13991 ms
before 14027 ms
testIncrementsSizeIffUpperBoundExceeded 14034 ms
tearDown 14296 ms
before 14330 ms
testIncrementsSizeInProportionToMetric 14338 ms
tearDown 14476 ms
before 14512 ms
testObeysMinAndMaxSize 14519 ms
tearDown 14658 ms
before 14691 ms
testWarnsWhenMaxCapReached 14698 ms
tearDown 15850 ms
at.ac.testing.brooklyn.literal.AutoScalerPolicyTest
setUpSolver 15916 ms
setUp 15922 ms
testConcurrentGrowGrow 15934 ms
tearDown 18686 ms
setUp 18780 ms
testConcurrentGrowShrink 18791 ms
tearDown 20515 ms
setUp 20558 ms
testConcurrentShrinkGrow 20569 ms
tearDown 22272 ms
setUp 22308 ms
testConcurrentShrinkShrink 22319 ms
tearDown 24055 ms
setUp 24088 ms
testGrowHotPool 24098 ms
tearDown 24680 ms
setUp 24713 ms
testNeverGrowAboveMaximmum 24723 ms
tearDown 24728 ms
setUp 24762 ms
testNeverGrowColdPool 24771 ms
tearDown 25604 ms
setUp 25651 ms
testNeverShrinkBelowMinimum 25661 ms
tearDown 26243 ms
setUp 26280 ms
testNeverShrinkHotPool 26288 ms
tearDown 27138 ms
setUp 27176 ms
testResizeDownStabilizationDelayIgnoresBlip 27185 ms
tearDown 28865 ms
setUp 28916 ms
testResizeDownStabilizationDelayResizesAfterDelay 28924 ms
tearDown 30518 ms
setUp 30577 ms
testResizeDownStabilizationDelayTakesMinSustainedDesired 30585 ms
tearDown 32925 ms
setUp 32959 ms
testResizeUpStabilizationDelayIgnoresBlip 32968 ms
tearDown 34631 ms
setUp 34671 ms
testResizeUpStabilizationDelayResizesAfterDelay 34678 ms
tearDown 36269 ms
setUp 36306 ms
testResizeUpStabilizationDelayTakesMaxSustainedDesired 36314 ms
tearDown 38666 ms
setUp 38699 ms
testShrinkColdPool 38706 ms
tearDown 39274 ms
setUp 39314 ms
testShrinkColdPoolRoundsUpDesiredNumberOfContainers 39321 ms
tearDown 39885 ms
at.ac.testing.brooklyn.literal.AutoScalerPolicyMetricTest
before 39919 ms
setUpSolver 39919 ms
testDecrementsSizeIffLowerBoundExceeded 39925 ms
tearDown 41311 ms
before 41373 ms
testDecrementsSizeInProportionToMetric 41379 ms
tearDown 43086 ms
before 43124 ms
testIncrementsSizeIffUpperBoundExceeded 43129 ms
tearDown 44538 ms
before 44576 ms
testIncrementsSizeInProportionToMetric 44581 ms
tearDown 45755 ms
before 45788 ms
testObeysMinAndMaxSize 45794 ms
tearDown 46945 ms
before 46979 ms
testWarnsWhenMaxCapReached 46985 ms
tearDown 49172 ms
at.ac.testing.brooklyn.equivalent.AutoScalerPolicyTest
setUp 49228 ms
setUpSolver 49228 ms
testConcurrentGrowGrow 49236 ms
tearDown 51139 ms
setUp 51193 ms
testConcurrentGrowShrink 51200 ms
tearDown 53114 ms
setUp 53154 ms
testConcurrentShrinkGrow 53161 ms
tearDown 55122 ms
setUp 55159 ms
testConcurrentShrinkShrink 55166 ms
tearDown 57063 ms
setUp 57101 ms
testGrowHotPool 57108 ms
tearDown 57669 ms
setUp 57701 ms
testNeverGrowAboveMaximmum 57710 ms
tearDown 58278 ms
setUp 58309 ms
testNeverGrowColdPool 58316 ms
tearDown 59135 ms
setUp 59170 ms
testNeverShrinkBelowMinimum 59177 ms
tearDown 59780 ms
setUp 59818 ms
testNeverShrinkHotPool 59825 ms
tearDown 60665 ms
setUp 60704 ms
testResizeDownStabilizationDelayIgnoresBlip 60711 ms
tearDown 63447 ms
setUp 63490 ms
testResizeDownStabilizationDelayResizesAfterDelay 63498 ms
tearDown 65131 ms
setUp 65171 ms
testResizeDownStabilizationDelayTakesMinSustainedDesired 65178 ms
tearDown 77481 ms
setUp 77542 ms
testResizeUpStabilizationDelayIgnoresBlip 77549 ms
tearDown 80201 ms
setUp 80238 ms
testResizeUpStabilizationDelayResizesAfterDelay 80246 ms
tearDown 81845 ms
setUp 81899 ms
testResizeUpStabilizationDelayTakesMaxSustainedDesired 81909 ms
tearDown 84785 ms
setUp 84821 ms
testShrinkColdPool 84828 ms
tearDown 85421 ms
setUp 85459 ms
testShrinkColdPoolRoundsUpDesiredNumberOfContainers 85468 ms
tearDown 86071 ms
at.ac.testing.brooklyn.equivalent.AutoScalerPolicyMetricTest
before 86108 ms
setUpSolver 86108 ms
testDecrementsSizeIffLowerBoundExceeded 86114 ms
tearDown 87496 ms
before 87529 ms
testDecrementsSizeInProportionToMetric 87535 ms
tearDown 89245 ms
before 89281 ms
testIncrementsSizeIffUpperBoundExceeded 89286 ms
tearDown 90694 ms
before 90730 ms
testIncrementsSizeInProportionToMetric 90737 ms
tearDown 91854 ms
before 91894 ms
testObeysMinAndMaxSize 91900 ms
tearDown 93031 ms
before 93070 ms
testWarnsWhenMaxCapReached 93077 ms
tearDown 95218 ms
at.ac.testing.brooklyn.scenario.AutoScalerPolicyTest
setUp 95277 ms
setUpSolver 95277 ms
testConcurrentGrowGrow 95285 ms
forceGC 125324 ms
tearDown 125401 ms
setUp 125443 ms
testConcurrentGrowShrink 125452 ms
forceGC 156055 ms
tearDown 156093 ms
setUp 156132 ms
testConcurrentShrinkGrow 156141 ms
forceGC 187124 ms
tearDown 187162 ms
setUp 187202 ms
testConcurrentShrinkShrink 187211 ms
forceGC 216259 ms
tearDown 216296 ms
setUp 216334 ms
testGrowHotPool 216341 ms
forceGC 225476 ms
tearDown 225514 ms
setUp 225554 ms
testNeverGrowAboveMaximmum 225568 ms
forceGC 234665 ms
tearDown 234699 ms
setUp 234736 ms
testNeverGrowColdPool 234744 ms
forceGC 243769 ms
tearDown 243810 ms
setUp 243846 ms
testNeverShrinkBelowMinimum 243855 ms
forceGC 253453 ms
tearDown 253489 ms
setUp 253527 ms
testNeverShrinkHotPool 253537 ms
forceGC 262696 ms
tearDown 262734 ms
setUp 262773 ms
testResizeDownStabilizationDelayIgnoresBlip 262783 ms
forceGC 288563 ms
tearDown 288604 ms
setUp 288641 ms
testResizeDownStabilizationDelayResizesAfterDelay 288649 ms
forceGC 310949 ms
tearDown 310985 ms
setUp 311022 ms
testResizeDownStabilizationDelayTakesMinSustainedDesired 311031 ms
forceGC 364985 ms
tearDown 365020 ms
setUp 365058 ms
testResizeUpStabilizationDelayIgnoresBlip 365067 ms
forceGC 392461 ms
tearDown 392494 ms
setUp 392535 ms
testResizeUpStabilizationDelayResizesAfterDelay 392543 ms
forceGC 414391 ms
tearDown 414437 ms
setUp 414473 ms
testResizeUpStabilizationDelayTakesMaxSustainedDesired 414481 ms
forceGC 458468 ms
tearDown 458526 ms
setUp 458569 ms
testShrinkColdPool 458576 ms
forceGC 467666 ms
tearDown 467704 ms
setUp 467740 ms
testShrinkColdPoolRoundsUpDesiredNumberOfContainers 467749 ms
forceGC 476864 ms
tearDown 476900 ms
at.ac.testing.brooklyn.scenario.AutoScalerPolicyMetricTest
before 476936 ms
setUpSolver 476936 ms
testDecrementsSizeIffLowerBoundExceeded 476941 ms
tearDown 498826 ms
before 498886 ms
testDecrementsSizeInProportionToMetric 498891 ms
tearDown 535963 ms
before 536020 ms
testIncrementsSizeIffUpperBoundExceeded 536025 ms
tearDown 558337 ms
before 558374 ms
testIncrementsSizeInProportionToMetric 558379 ms
tearDown 581633 ms
before 581678 ms
testObeysMinAndMaxSize 581682 ms
tearDown 603709 ms
before 603751 ms
testWarnsWhenMaxCapReached 603756 ms
tearDown 626582 ms
at.ac.testing.brooklyn.mixed.AutoScalerPolicyTest
setUp 626631 ms
setUpSolver 626631 ms
testConcurrentGrowGrow 626637 ms
forceGC 654993 ms
tearDown 655050 ms
setUp 655096 ms
testConcurrentGrowShrink 655103 ms
forceGC 684383 ms
tearDown 684422 ms
setUp 684458 ms
testConcurrentShrinkGrow 684465 ms
forceGC 712867 ms
tearDown 712903 ms
setUp 712943 ms
testConcurrentShrinkShrink 712951 ms
forceGC 742004 ms
tearDown 742041 ms
setUp 742081 ms
testGrowHotPool 742087 ms
forceGC 742668 ms
tearDown 742700 ms
setUp 742737 ms
testNeverGrowAboveMaximmum 742745 ms
forceGC 752011 ms
tearDown 752051 ms
setUp 752090 ms
testNeverGrowColdPool 752098 ms
forceGC 752960 ms
tearDown 752994 ms
setUp 753037 ms
testNeverShrinkBelowMinimum 753044 ms
forceGC 762899 ms
tearDown 762934 ms
setUp 762968 ms
testNeverShrinkHotPool 762976 ms
forceGC 763823 ms
tearDown 763857 ms
setUp 763896 ms
testResizeDownStabilizationDelayIgnoresBlip 763905 ms
forceGC 789638 ms
tearDown 789677 ms
setUp 789735 ms
testResizeDownStabilizationDelayResizesAfterDelay 789744 ms
forceGC 791333 ms
tearDown 791368 ms
setUp 791409 ms
testResizeDownStabilizationDelayTakesMinSustainedDesired 791417 ms
forceGC 845755 ms
tearDown 845793 ms
setUp 845833 ms
testResizeUpStabilizationDelayIgnoresBlip 845841 ms
forceGC 872653 ms
tearDown 872688 ms
setUp 872726 ms
testResizeUpStabilizationDelayResizesAfterDelay 872735 ms
forceGC 874358 ms
tearDown 874394 ms
setUp 874437 ms
testResizeUpStabilizationDelayTakesMaxSustainedDesired 874444 ms
forceGC 918832 ms
tearDown 918867 ms
setUp 918908 ms
testShrinkColdPool 918914 ms
forceGC 919496 ms
tearDown 919529 ms
setUp 919569 ms
testShrinkColdPoolRoundsUpDesiredNumberOfContainers 919578 ms
forceGC 920169 ms
tearDown 920202 ms
at.ac.testing.brooklyn.mixed.AutoScalerPolicyMetricTest
setUpSolver 920242 ms
before 920243 ms
testDecrementsSizeIffLowerBoundExceeded 920248 ms
tearDown 921654 ms
before 921691 ms
testDecrementsSizeInProportionToMetric 921695 ms
tearDown 923378 ms
before 923413 ms
testIncrementsSizeIffUpperBoundExceeded 923418 ms
tearDown 924818 ms
before 924855 ms
testIncrementsSizeInProportionToMetric 924860 ms
tearDown 925985 ms
before 926026 ms
testObeysMinAndMaxSize 926032 ms
tearDown 948351 ms
before 948393 ms
testWarnsWhenMaxCapReached 948398 ms
tearDown 971277 ms
Methods in chronological order
at.ac.testing.brooklyn.original.AutoScalerPolicyTest
setUp 0 ms
testConcurrentGrowGrow 242 ms
tearDown 820 ms
setUp 918 ms
testConcurrentGrowShrink 937 ms
tearDown 1714 ms
setUp 1778 ms
testConcurrentShrinkGrow 1797 ms
tearDown 2571 ms
setUp 2657 ms
testConcurrentShrinkShrink 2678 ms
tearDown 3450 ms
setUp 3537 ms
testGrowHotPool 3553 ms
tearDown 3557 ms
setUp 3597 ms
testNeverGrowAboveMaximmum 3614 ms
tearDown 3622 ms
setUp 3688 ms
testNeverGrowColdPool 3704 ms
tearDown 3957 ms
setUp 3998 ms
testNeverShrinkBelowMinimum 4015 ms
tearDown 4021 ms
setUp 4073 ms
testNeverShrinkHotPool 4087 ms
tearDown 4339 ms
setUp 4372 ms
testResizeDownStabilizationDelayIgnoresBlip 4386 ms
tearDown 5909 ms
setUp 5983 ms
testResizeDownStabilizationDelayResizesAfterDelay 5997 ms
tearDown 7023 ms
setUp 7089 ms
testResizeDownStabilizationDelayTakesMinSustainedDesired 7101 ms
tearDown 8806 ms
setUp 8838 ms
testResizeUpStabilizationDelayIgnoresBlip 8850 ms
tearDown 10359 ms
setUp 10393 ms
testResizeUpStabilizationDelayResizesAfterDelay 10404 ms
tearDown 11428 ms
setUp 11463 ms
testResizeUpStabilizationDelayTakesMaxSustainedDesired 11474 ms
tearDown 13179 ms
setUp 13249 ms
testShrinkColdPool 13261 ms
tearDown 13264 ms
setUp 13337 ms
testShrinkColdPoolRoundsUpDesiredNumberOfContainers 13348 ms
tearDown 13351 ms
at.ac.testing.brooklyn.original.AutoScalerPolicyMetricTest
before 13414 ms
testDecrementsSizeIffLowerBoundExceeded 13421 ms
tearDown 13688 ms
before 13774 ms
testDecrementsSizeInProportionToMetric 13781 ms
tearDown 13991 ms
before 14027 ms
testIncrementsSizeIffUpperBoundExceeded 14034 ms
tearDown 14296 ms
before 14330 ms
testIncrementsSizeInProportionToMetric 14338 ms
tearDown 14476 ms
before 14512 ms
testObeysMinAndMaxSize 14519 ms
tearDown 14658 ms
before 14691 ms
testWarnsWhenMaxCapReached 14698 ms
tearDown 15850 ms
at.ac.testing.brooklyn.literal.AutoScalerPolicyTest
setUpSolver 15916 ms
setUp 15922 ms
testConcurrentGrowGrow 15934 ms
tearDown 18686 ms
setUp 18780 ms
testConcurrentGrowShrink 18791 ms
tearDown 20515 ms
setUp 20558 ms
testConcurrentShrinkGrow 20569 ms
tearDown 22272 ms
setUp 22308 ms
testConcurrentShrinkShrink 22319 ms
tearDown 24055 ms
setUp 24088 ms
testGrowHotPool 24098 ms
tearDown 24680 ms
setUp 24713 ms
testNeverGrowAboveMaximmum 24723 ms
tearDown 24728 ms
setUp 24762 ms
testNeverGrowColdPool 24771 ms
tearDown 25604 ms
setUp 25651 ms
testNeverShrinkBelowMinimum 25661 ms
tearDown 26243 ms
setUp 26280 ms
testNeverShrinkHotPool 26288 ms
tearDown 27138 ms
setUp 27176 ms
testResizeDownStabilizationDelayIgnoresBlip 27185 ms
tearDown 28865 ms
setUp 28916 ms
testResizeDownStabilizationDelayResizesAfterDelay 28924 ms
tearDown 30518 ms
setUp 30577 ms
testResizeDownStabilizationDelayTakesMinSustainedDesired 30585 ms
tearDown 32925 ms
setUp 32959 ms
testResizeUpStabilizationDelayIgnoresBlip 32968 ms
tearDown 34631 ms
setUp 34671 ms
testResizeUpStabilizationDelayResizesAfterDelay 34678 ms
tearDown 36269 ms
setUp 36306 ms
testResizeUpStabilizationDelayTakesMaxSustainedDesired 36314 ms
tearDown 38666 ms
setUp 38699 ms
testShrinkColdPool 38706 ms
tearDown 39274 ms
setUp 39314 ms
testShrinkColdPoolRoundsUpDesiredNumberOfContainers 39321 ms
tearDown 39885 ms
at.ac.testing.brooklyn.literal.AutoScalerPolicyMetricTest
before 39919 ms
setUpSolver 39919 ms
testDecrementsSizeIffLowerBoundExceeded 39925 ms
tearDown 41311 ms
before 41373 ms
testDecrementsSizeInProportionToMetric 41379 ms
tearDown 43086 ms
before 43124 ms
testIncrementsSizeIffUpperBoundExceeded 43129 ms
tearDown 44538 ms
before 44576 ms
testIncrementsSizeInProportionToMetric 44581 ms
tearDown 45755 ms
before 45788 ms
testObeysMinAndMaxSize 45794 ms
tearDown 46945 ms
before 46979 ms
testWarnsWhenMaxCapReached 46985 ms
tearDown 49172 ms
at.ac.testing.brooklyn.equivalent.AutoScalerPolicyTest
setUp 49228 ms
setUpSolver 49228 ms
testConcurrentGrowGrow 49236 ms
tearDown 51139 ms
setUp 51193 ms
testConcurrentGrowShrink 51200 ms
tearDown 53114 ms
setUp 53154 ms
testConcurrentShrinkGrow 53161 ms
tearDown 55122 ms
setUp 55159 ms
testConcurrentShrinkShrink 55166 ms
tearDown 57063 ms
setUp 57101 ms
testGrowHotPool 57108 ms
tearDown 57669 ms
setUp 57701 ms
testNeverGrowAboveMaximmum 57710 ms
tearDown 58278 ms
setUp 58309 ms
testNeverGrowColdPool 58316 ms
tearDown 59135 ms
setUp 59170 ms
testNeverShrinkBelowMinimum 59177 ms
tearDown 59780 ms
setUp 59818 ms
testNeverShrinkHotPool 59825 ms
tearDown 60665 ms
setUp 60704 ms
testResizeDownStabilizationDelayIgnoresBlip 60711 ms
tearDown 63447 ms
setUp 63490 ms
testResizeDownStabilizationDelayResizesAfterDelay 63498 ms
tearDown 65131 ms
setUp 65171 ms
testResizeDownStabilizationDelayTakesMinSustainedDesired 65178 ms
tearDown 77481 ms
setUp 77542 ms
testResizeUpStabilizationDelayIgnoresBlip 77549 ms
tearDown 80201 ms
setUp 80238 ms
testResizeUpStabilizationDelayResizesAfterDelay 80246 ms
tearDown 81845 ms
setUp 81899 ms
testResizeUpStabilizationDelayTakesMaxSustainedDesired 81909 ms
tearDown 84785 ms
setUp 84821 ms
testShrinkColdPool 84828 ms
tearDown 85421 ms
setUp 85459 ms
testShrinkColdPoolRoundsUpDesiredNumberOfContainers 85468 ms
tearDown 86071 ms
at.ac.testing.brooklyn.equivalent.AutoScalerPolicyMetricTest
before 86108 ms
setUpSolver 86108 ms
testDecrementsSizeIffLowerBoundExceeded 86114 ms
tearDown 87496 ms
before 87529 ms
testDecrementsSizeInProportionToMetric 87535 ms
tearDown 89245 ms
before 89281 ms
testIncrementsSizeIffUpperBoundExceeded 89286 ms
tearDown 90694 ms
before 90730 ms
testIncrementsSizeInProportionToMetric 90737 ms
tearDown 91854 ms
before 91894 ms
testObeysMinAndMaxSize 91900 ms
tearDown 93031 ms
before 93070 ms
testWarnsWhenMaxCapReached 93077 ms
tearDown 95218 ms
at.ac.testing.brooklyn.scenario.AutoScalerPolicyTest
setUp 95277 ms
setUpSolver 95277 ms
testConcurrentGrowGrow 95285 ms
forceGC 125324 ms
tearDown 125401 ms
setUp 125443 ms
testConcurrentGrowShrink 125452 ms
forceGC 156055 ms
tearDown 156093 ms
setUp 156132 ms
testConcurrentShrinkGrow 156141 ms
forceGC 187124 ms
tearDown 187162 ms
setUp 187202 ms
testConcurrentShrinkShrink 187211 ms
forceGC 216259 ms
tearDown 216296 ms
setUp 216334 ms
testGrowHotPool 216341 ms
forceGC 225476 ms
tearDown 225514 ms
setUp 225554 ms
testNeverGrowAboveMaximmum 225568 ms
forceGC 234665 ms
tearDown 234699 ms
setUp 234736 ms
testNeverGrowColdPool 234744 ms
forceGC 243769 ms
tearDown 243810 ms
setUp 243846 ms
testNeverShrinkBelowMinimum 243855 ms
forceGC 253453 ms
tearDown 253489 ms
setUp 253527 ms
testNeverShrinkHotPool 253537 ms
forceGC 262696 ms
tearDown 262734 ms
setUp 262773 ms
testResizeDownStabilizationDelayIgnoresBlip 262783 ms
forceGC 288563 ms
tearDown 288604 ms
setUp 288641 ms
testResizeDownStabilizationDelayResizesAfterDelay 288649 ms
forceGC 310949 ms
tearDown 310985 ms
setUp 311022 ms
testResizeDownStabilizationDelayTakesMinSustainedDesired 311031 ms
forceGC 364985 ms
tearDown 365020 ms
setUp 365058 ms
testResizeUpStabilizationDelayIgnoresBlip 365067 ms
forceGC 392461 ms
tearDown 392494 ms
setUp 392535 ms
testResizeUpStabilizationDelayResizesAfterDelay 392543 ms
forceGC 414391 ms
tearDown 414437 ms
setUp 414473 ms
testResizeUpStabilizationDelayTakesMaxSustainedDesired 414481 ms
forceGC 458468 ms
tearDown 458526 ms
setUp 458569 ms
testShrinkColdPool 458576 ms
forceGC 467666 ms
tearDown 467704 ms
setUp 467740 ms
testShrinkColdPoolRoundsUpDesiredNumberOfContainers 467749 ms
forceGC 476864 ms
tearDown 476900 ms
at.ac.testing.brooklyn.scenario.AutoScalerPolicyMetricTest
before 476936 ms
setUpSolver 476936 ms
testDecrementsSizeIffLowerBoundExceeded 476941 ms
tearDown 498826 ms
before 498886 ms
testDecrementsSizeInProportionToMetric 498891 ms
tearDown 535963 ms
before 536020 ms
testIncrementsSizeIffUpperBoundExceeded 536025 ms
tearDown 558337 ms
before 558374 ms
testIncrementsSizeInProportionToMetric 558379 ms
tearDown 581633 ms
before 581678 ms
testObeysMinAndMaxSize 581682 ms
tearDown 603709 ms
before 603751 ms
testWarnsWhenMaxCapReached 603756 ms
tearDown 626582 ms
at.ac.testing.brooklyn.mixed.AutoScalerPolicyTest
setUp 626631 ms
setUpSolver 626631 ms
testConcurrentGrowGrow 626637 ms
forceGC 654993 ms
tearDown 655050 ms
setUp 655096 ms
testConcurrentGrowShrink 655103 ms
forceGC 684383 ms
tearDown 684422 ms
setUp 684458 ms
testConcurrentShrinkGrow 684465 ms
forceGC 712867 ms
tearDown 712903 ms
setUp 712943 ms
testConcurrentShrinkShrink 712951 ms
forceGC 742004 ms
tearDown 742041 ms
setUp 742081 ms
testGrowHotPool 742087 ms
forceGC 742668 ms
tearDown 742700 ms
setUp 742737 ms
testNeverGrowAboveMaximmum 742745 ms
forceGC 752011 ms
tearDown 752051 ms
setUp 752090 ms
testNeverGrowColdPool 752098 ms
forceGC 752960 ms
tearDown 752994 ms
setUp 753037 ms
testNeverShrinkBelowMinimum 753044 ms
forceGC 762899 ms
tearDown 762934 ms
setUp 762968 ms
testNeverShrinkHotPool 762976 ms
forceGC 763823 ms
tearDown 763857 ms
setUp 763896 ms
testResizeDownStabilizationDelayIgnoresBlip 763905 ms
forceGC 789638 ms
tearDown 789677 ms
setUp 789735 ms
testResizeDownStabilizationDelayResizesAfterDelay 789744 ms
forceGC 791333 ms
tearDown 791368 ms
setUp 791409 ms
testResizeDownStabilizationDelayTakesMinSustainedDesired 791417 ms
forceGC 845755 ms
tearDown 845793 ms
setUp 845833 ms
testResizeUpStabilizationDelayIgnoresBlip 845841 ms
forceGC 872653 ms
tearDown 872688 ms
setUp 872726 ms
testResizeUpStabilizationDelayResizesAfterDelay 872735 ms
forceGC 874358 ms
tearDown 874394 ms
setUp 874437 ms
testResizeUpStabilizationDelayTakesMaxSustainedDesired 874444 ms
forceGC 918832 ms
tearDown 918867 ms
setUp 918908 ms
testShrinkColdPool 918914 ms
forceGC 919496 ms
tearDown 919529 ms
setUp 919569 ms
testShrinkColdPoolRoundsUpDesiredNumberOfContainers 919578 ms
forceGC 920169 ms
tearDown 920202 ms
at.ac.testing.brooklyn.mixed.AutoScalerPolicyMetricTest
setUpSolver 920242 ms
before 920243 ms
testDecrementsSizeIffLowerBoundExceeded 920248 ms
tearDown 921654 ms
before 921691 ms
testDecrementsSizeInProportionToMetric 921695 ms
tearDown 923378 ms
before 923413 ms
testIncrementsSizeIffUpperBoundExceeded 923418 ms
tearDown 924818 ms
before 924855 ms
testIncrementsSizeInProportionToMetric 924860 ms
tearDown 925985 ms
before 926026 ms
testObeysMinAndMaxSize 926032 ms
tearDown 948351 ms
before 948393 ms
testWarnsWhenMaxCapReached 948398 ms
tearDown 971277 ms
Methods in chronological order
at.ac.testing.brooklyn.original.AutoScalerPolicyTest
setUp 0 ms
testConcurrentGrowGrow 242 ms
tearDown 820 ms
setUp 918 ms
testConcurrentGrowShrink 937 ms
tearDown 1714 ms
setUp 1778 ms
testConcurrentShrinkGrow 1797 ms
tearDown 2571 ms
setUp 2657 ms
testConcurrentShrinkShrink 2678 ms
tearDown 3450 ms
setUp 3537 ms
testGrowHotPool 3553 ms
tearDown 3557 ms
setUp 3597 ms
testNeverGrowAboveMaximmum 3614 ms
tearDown 3622 ms
setUp 3688 ms
testNeverGrowColdPool 3704 ms
tearDown 3957 ms
setUp 3998 ms
testNeverShrinkBelowMinimum 4015 ms
tearDown 4021 ms
setUp 4073 ms
testNeverShrinkHotPool 4087 ms
tearDown 4339 ms
setUp 4372 ms
testResizeDownStabilizationDelayIgnoresBlip 4386 ms
tearDown 5909 ms
setUp 5983 ms
testResizeDownStabilizationDelayResizesAfterDelay 5997 ms
tearDown 7023 ms
setUp 7089 ms
testResizeDownStabilizationDelayTakesMinSustainedDesired 7101 ms
tearDown 8806 ms
setUp 8838 ms
testResizeUpStabilizationDelayIgnoresBlip 8850 ms
tearDown 10359 ms
setUp 10393 ms
testResizeUpStabilizationDelayResizesAfterDelay 10404 ms
tearDown 11428 ms
setUp 11463 ms
testResizeUpStabilizationDelayTakesMaxSustainedDesired 11474 ms
tearDown 13179 ms
setUp 13249 ms
testShrinkColdPool 13261 ms
tearDown 13264 ms
setUp 13337 ms
testShrinkColdPoolRoundsUpDesiredNumberOfContainers 13348 ms
tearDown 13351 ms
at.ac.testing.brooklyn.original.AutoScalerPolicyMetricTest
before 13414 ms
testDecrementsSizeIffLowerBoundExceeded 13421 ms
tearDown 13688 ms
before 13774 ms
testDecrementsSizeInProportionToMetric 13781 ms
tearDown 13991 ms
before 14027 ms
testIncrementsSizeIffUpperBoundExceeded 14034 ms
tearDown 14296 ms
before 14330 ms
testIncrementsSizeInProportionToMetric 14338 ms
tearDown 14476 ms
before 14512 ms
testObeysMinAndMaxSize 14519 ms
tearDown 14658 ms
before 14691 ms
testWarnsWhenMaxCapReached 14698 ms
tearDown 15850 ms
at.ac.testing.brooklyn.literal.AutoScalerPolicyTest
setUpSolver 15916 ms
setUp 15922 ms
testConcurrentGrowGrow 15934 ms
tearDown 18686 ms
setUp 18780 ms
testConcurrentGrowShrink 18791 ms
tearDown 20515 ms
setUp 20558 ms
testConcurrentShrinkGrow 20569 ms
tearDown 22272 ms
setUp 22308 ms
testConcurrentShrinkShrink 22319 ms
tearDown 24055 ms
setUp 24088 ms
testGrowHotPool 24098 ms
tearDown 24680 ms
setUp 24713 ms
testNeverGrowAboveMaximmum 24723 ms
tearDown 24728 ms
setUp 24762 ms
testNeverGrowColdPool 24771 ms
tearDown 25604 ms
setUp 25651 ms
testNeverShrinkBelowMinimum 25661 ms
tearDown 26243 ms
setUp 26280 ms
testNeverShrinkHotPool 26288 ms
tearDown 27138 ms
setUp 27176 ms
testResizeDownStabilizationDelayIgnoresBlip 27185 ms
tearDown 28865 ms
setUp 28916 ms
testResizeDownStabilizationDelayResizesAfterDelay 28924 ms
tearDown 30518 ms
setUp 30577 ms
testResizeDownStabilizationDelayTakesMinSustainedDesired 30585 ms
tearDown 32925 ms
setUp 32959 ms
testResizeUpStabilizationDelayIgnoresBlip 32968 ms
tearDown 34631 ms
setUp 34671 ms
testResizeUpStabilizationDelayResizesAfterDelay 34678 ms
tearDown 36269 ms
setUp 36306 ms
testResizeUpStabilizationDelayTakesMaxSustainedDesired 36314 ms
tearDown 38666 ms
setUp 38699 ms
testShrinkColdPool 38706 ms
tearDown 39274 ms
setUp 39314 ms
testShrinkColdPoolRoundsUpDesiredNumberOfContainers 39321 ms
tearDown 39885 ms
at.ac.testing.brooklyn.literal.AutoScalerPolicyMetricTest
before 39919 ms
setUpSolver 39919 ms
testDecrementsSizeIffLowerBoundExceeded 39925 ms
tearDown 41311 ms
before 41373 ms
testDecrementsSizeInProportionToMetric 41379 ms
tearDown 43086 ms
before 43124 ms
testIncrementsSizeIffUpperBoundExceeded 43129 ms
tearDown 44538 ms
before 44576 ms
testIncrementsSizeInProportionToMetric 44581 ms
tearDown 45755 ms
before 45788 ms
testObeysMinAndMaxSize 45794 ms
tearDown 46945 ms
before 46979 ms
testWarnsWhenMaxCapReached 46985 ms
tearDown 49172 ms
at.ac.testing.brooklyn.equivalent.AutoScalerPolicyTest
setUp 49228 ms
setUpSolver 49228 ms
testConcurrentGrowGrow 49236 ms
tearDown 51139 ms
setUp 51193 ms
testConcurrentGrowShrink 51200 ms
tearDown 53114 ms
setUp 53154 ms
testConcurrentShrinkGrow 53161 ms
tearDown 55122 ms
setUp 55159 ms
testConcurrentShrinkShrink 55166 ms
tearDown 57063 ms
setUp 57101 ms
testGrowHotPool 57108 ms
tearDown 57669 ms
setUp 57701 ms
testNeverGrowAboveMaximmum 57710 ms
tearDown 58278 ms
setUp 58309 ms
testNeverGrowColdPool 58316 ms
tearDown 59135 ms
setUp 59170 ms
testNeverShrinkBelowMinimum 59177 ms
tearDown 59780 ms
setUp 59818 ms
testNeverShrinkHotPool 59825 ms
tearDown 60665 ms
setUp 60704 ms
testResizeDownStabilizationDelayIgnoresBlip 60711 ms
tearDown 63447 ms
setUp 63490 ms
testResizeDownStabilizationDelayResizesAfterDelay 63498 ms
tearDown 65131 ms
setUp 65171 ms
testResizeDownStabilizationDelayTakesMinSustainedDesired 65178 ms
tearDown 77481 ms
setUp 77542 ms
testResizeUpStabilizationDelayIgnoresBlip 77549 ms
tearDown 80201 ms
setUp 80238 ms
testResizeUpStabilizationDelayResizesAfterDelay 80246 ms
tearDown 81845 ms
setUp 81899 ms
testResizeUpStabilizationDelayTakesMaxSustainedDesired 81909 ms
tearDown 84785 ms
setUp 84821 ms
testShrinkColdPool 84828 ms
tearDown 85421 ms
setUp 85459 ms
testShrinkColdPoolRoundsUpDesiredNumberOfContainers 85468 ms
tearDown 86071 ms
at.ac.testing.brooklyn.equivalent.AutoScalerPolicyMetricTest
before 86108 ms
setUpSolver 86108 ms
testDecrementsSizeIffLowerBoundExceeded 86114 ms
tearDown 87496 ms
before 87529 ms
testDecrementsSizeInProportionToMetric 87535 ms
tearDown 89245 ms
before 89281 ms
testIncrementsSizeIffUpperBoundExceeded 89286 ms
tearDown 90694 ms
before 90730 ms
testIncrementsSizeInProportionToMetric 90737 ms
tearDown 91854 ms
before 91894 ms
testObeysMinAndMaxSize 91900 ms
tearDown 93031 ms
before 93070 ms
testWarnsWhenMaxCapReached 93077 ms
tearDown 95218 ms
at.ac.testing.brooklyn.scenario.AutoScalerPolicyTest
setUp 95277 ms
setUpSolver 95277 ms
testConcurrentGrowGrow 95285 ms
forceGC 125324 ms
tearDown 125401 ms
setUp 125443 ms
testConcurrentGrowShrink 125452 ms
forceGC 156055 ms
tearDown 156093 ms
setUp 156132 ms
testConcurrentShrinkGrow 156141 ms
forceGC 187124 ms
tearDown 187162 ms
setUp 187202 ms
testConcurrentShrinkShrink 187211 ms
forceGC 216259 ms
tearDown 216296 ms
setUp 216334 ms
testGrowHotPool 216341 ms
forceGC 225476 ms
tearDown 225514 ms
setUp 225554 ms
testNeverGrowAboveMaximmum 225568 ms
forceGC 234665 ms
tearDown 234699 ms
setUp 234736 ms
testNeverGrowColdPool 234744 ms
forceGC 243769 ms
tearDown 243810 ms
setUp 243846 ms
testNeverShrinkBelowMinimum 243855 ms
forceGC 253453 ms
tearDown 253489 ms
setUp 253527 ms
testNeverShrinkHotPool 253537 ms
forceGC 262696 ms
tearDown 262734 ms
setUp 262773 ms
testResizeDownStabilizationDelayIgnoresBlip 262783 ms
forceGC 288563 ms
tearDown 288604 ms
setUp 288641 ms
testResizeDownStabilizationDelayResizesAfterDelay 288649 ms
forceGC 310949 ms
tearDown 310985 ms
setUp 311022 ms
testResizeDownStabilizationDelayTakesMinSustainedDesired 311031 ms
forceGC 364985 ms
tearDown 365020 ms
setUp 365058 ms
testResizeUpStabilizationDelayIgnoresBlip 365067 ms
forceGC 392461 ms
tearDown 392494 ms
setUp 392535 ms
testResizeUpStabilizationDelayResizesAfterDelay 392543 ms
forceGC 414391 ms
tearDown 414437 ms
setUp 414473 ms
testResizeUpStabilizationDelayTakesMaxSustainedDesired 414481 ms
forceGC 458468 ms
tearDown 458526 ms
setUp 458569 ms
testShrinkColdPool 458576 ms
forceGC 467666 ms
tearDown 467704 ms
setUp 467740 ms
testShrinkColdPoolRoundsUpDesiredNumberOfContainers 467749 ms
forceGC 476864 ms
tearDown 476900 ms
at.ac.testing.brooklyn.scenario.AutoScalerPolicyMetricTest
before 476936 ms
setUpSolver 476936 ms
testDecrementsSizeIffLowerBoundExceeded 476941 ms
tearDown 498826 ms
before 498886 ms
testDecrementsSizeInProportionToMetric 498891 ms
tearDown 535963 ms
before 536020 ms
testIncrementsSizeIffUpperBoundExceeded 536025 ms
tearDown 558337 ms
before 558374 ms
testIncrementsSizeInProportionToMetric 558379 ms
tearDown 581633 ms
before 581678 ms
testObeysMinAndMaxSize 581682 ms
tearDown 603709 ms
before 603751 ms
testWarnsWhenMaxCapReached 603756 ms
tearDown 626582 ms
at.ac.testing.brooklyn.mixed.AutoScalerPolicyTest
setUp 626631 ms
setUpSolver 626631 ms
testConcurrentGrowGrow 626637 ms
forceGC 654993 ms
tearDown 655050 ms
setUp 655096 ms
testConcurrentGrowShrink 655103 ms
forceGC 684383 ms
tearDown 684422 ms
setUp 684458 ms
testConcurrentShrinkGrow 684465 ms
forceGC 712867 ms
tearDown 712903 ms
setUp 712943 ms
testConcurrentShrinkShrink 712951 ms
forceGC 742004 ms
tearDown 742041 ms
setUp 742081 ms
testGrowHotPool 742087 ms
forceGC 742668 ms
tearDown 742700 ms
setUp 742737 ms
testNeverGrowAboveMaximmum 742745 ms
forceGC 752011 ms
tearDown 752051 ms
setUp 752090 ms
testNeverGrowColdPool 752098 ms
forceGC 752960 ms
tearDown 752994 ms
setUp 753037 ms
testNeverShrinkBelowMinimum 753044 ms
forceGC 762899 ms
tearDown 762934 ms
setUp 762968 ms
testNeverShrinkHotPool 762976 ms
forceGC 763823 ms
tearDown 763857 ms
setUp 763896 ms
testResizeDownStabilizationDelayIgnoresBlip 763905 ms
forceGC 789638 ms
tearDown 789677 ms
setUp 789735 ms
testResizeDownStabilizationDelayResizesAfterDelay 789744 ms
forceGC 791333 ms
tearDown 791368 ms
setUp 791409 ms
testResizeDownStabilizationDelayTakesMinSustainedDesired 791417 ms
forceGC 845755 ms
tearDown 845793 ms
setUp 845833 ms
testResizeUpStabilizationDelayIgnoresBlip 845841 ms
forceGC 872653 ms
tearDown 872688 ms
setUp 872726 ms
testResizeUpStabilizationDelayResizesAfterDelay 872735 ms
forceGC 874358 ms
tearDown 874394 ms
setUp 874437 ms
testResizeUpStabilizationDelayTakesMaxSustainedDesired 874444 ms
forceGC 918832 ms
tearDown 918867 ms
setUp 918908 ms
testShrinkColdPool 918914 ms
forceGC 919496 ms
tearDown 919529 ms
setUp 919569 ms
testShrinkColdPoolRoundsUpDesiredNumberOfContainers 919578 ms
forceGC 920169 ms
tearDown 920202 ms
at.ac.testing.brooklyn.mixed.AutoScalerPolicyMetricTest
setUpSolver 920242 ms
before 920243 ms
testDecrementsSizeIffLowerBoundExceeded 920248 ms
tearDown 921654 ms
before 921691 ms
testDecrementsSizeInProportionToMetric 921695 ms
tearDown 923378 ms
before 923413 ms
testIncrementsSizeIffUpperBoundExceeded 923418 ms
tearDown 924818 ms
before 924855 ms
testIncrementsSizeInProportionToMetric 924860 ms
tearDown 925985 ms
before 926026 ms
testObeysMinAndMaxSize 926032 ms
tearDown 948351 ms
before 948393 ms
testWarnsWhenMaxCapReached 948398 ms
tearDown 971277 ms
Methods in chronological order
at.ac.testing.brooklyn.original.AutoScalerPolicyTest
setUp 0 ms
testConcurrentGrowGrow 242 ms
tearDown 820 ms
setUp 918 ms
testConcurrentGrowShrink 937 ms
tearDown 1714 ms
setUp 1778 ms
testConcurrentShrinkGrow 1797 ms
tearDown 2571 ms
setUp 2657 ms
testConcurrentShrinkShrink 2678 ms
tearDown 3450 ms
setUp 3537 ms
testGrowHotPool 3553 ms
tearDown 3557 ms
setUp 3597 ms
testNeverGrowAboveMaximmum 3614 ms
tearDown 3622 ms
setUp 3688 ms
testNeverGrowColdPool 3704 ms
tearDown 3957 ms
setUp 3998 ms
testNeverShrinkBelowMinimum 4015 ms
tearDown 4021 ms
setUp 4073 ms
testNeverShrinkHotPool 4087 ms
tearDown 4339 ms
setUp 4372 ms
testResizeDownStabilizationDelayIgnoresBlip 4386 ms
tearDown 5909 ms
setUp 5983 ms
testResizeDownStabilizationDelayResizesAfterDelay 5997 ms
tearDown 7023 ms
setUp 7089 ms
testResizeDownStabilizationDelayTakesMinSustainedDesired 7101 ms
tearDown 8806 ms
setUp 8838 ms
testResizeUpStabilizationDelayIgnoresBlip 8850 ms
tearDown 10359 ms
setUp 10393 ms
testResizeUpStabilizationDelayResizesAfterDelay 10404 ms
tearDown 11428 ms
setUp 11463 ms
testResizeUpStabilizationDelayTakesMaxSustainedDesired 11474 ms
tearDown 13179 ms
setUp 13249 ms
testShrinkColdPool 13261 ms
tearDown 13264 ms
setUp 13337 ms
testShrinkColdPoolRoundsUpDesiredNumberOfContainers 13348 ms
tearDown 13351 ms
at.ac.testing.brooklyn.original.AutoScalerPolicyMetricTest
before 13414 ms
testDecrementsSizeIffLowerBoundExceeded 13421 ms
tearDown 13688 ms
before 13774 ms
testDecrementsSizeInProportionToMetric 13781 ms
tearDown 13991 ms
before 14027 ms
testIncrementsSizeIffUpperBoundExceeded 14034 ms
tearDown 14296 ms
before 14330 ms
testIncrementsSizeInProportionToMetric 14338 ms
tearDown 14476 ms
before 14512 ms
testObeysMinAndMaxSize 14519 ms
tearDown 14658 ms
before 14691 ms
testWarnsWhenMaxCapReached 14698 ms
tearDown 15850 ms
at.ac.testing.brooklyn.literal.AutoScalerPolicyTest
setUpSolver 15916 ms
setUp 15922 ms
testConcurrentGrowGrow 15934 ms
tearDown 18686 ms
setUp 18780 ms
testConcurrentGrowShrink 18791 ms
tearDown 20515 ms
setUp 20558 ms
testConcurrentShrinkGrow 20569 ms
tearDown 22272 ms
setUp 22308 ms
testConcurrentShrinkShrink 22319 ms
tearDown 24055 ms
setUp 24088 ms
testGrowHotPool 24098 ms
tearDown 24680 ms
setUp 24713 ms
testNeverGrowAboveMaximmum 24723 ms
tearDown 24728 ms
setUp 24762 ms
testNeverGrowColdPool 24771 ms
tearDown 25604 ms
setUp 25651 ms
testNeverShrinkBelowMinimum 25661 ms
tearDown 26243 ms
setUp 26280 ms
testNeverShrinkHotPool 26288 ms
tearDown 27138 ms
setUp 27176 ms
testResizeDownStabilizationDelayIgnoresBlip 27185 ms
tearDown 28865 ms
setUp 28916 ms
testResizeDownStabilizationDelayResizesAfterDelay 28924 ms
tearDown 30518 ms
setUp 30577 ms
testResizeDownStabilizationDelayTakesMinSustainedDesired 30585 ms
tearDown 32925 ms
setUp 32959 ms
testResizeUpStabilizationDelayIgnoresBlip 32968 ms
tearDown 34631 ms
setUp 34671 ms
testResizeUpStabilizationDelayResizesAfterDelay 34678 ms
tearDown 36269 ms
setUp 36306 ms
testResizeUpStabilizationDelayTakesMaxSustainedDesired 36314 ms
tearDown 38666 ms
setUp 38699 ms
testShrinkColdPool 38706 ms
tearDown 39274 ms
setUp 39314 ms
testShrinkColdPoolRoundsUpDesiredNumberOfContainers 39321 ms
tearDown 39885 ms
at.ac.testing.brooklyn.literal.AutoScalerPolicyMetricTest
setUpSolver 39919 ms
before 39919 ms
testDecrementsSizeIffLowerBoundExceeded 39925 ms
tearDown 41311 ms
before 41373 ms
testDecrementsSizeInProportionToMetric 41379 ms
tearDown 43086 ms
before 43124 ms
testIncrementsSizeIffUpperBoundExceeded 43129 ms
tearDown 44538 ms
before 44576 ms
testIncrementsSizeInProportionToMetric 44581 ms
tearDown 45755 ms
before 45788 ms
testObeysMinAndMaxSize 45794 ms
tearDown 46945 ms
before 46979 ms
testWarnsWhenMaxCapReached 46985 ms
tearDown 49172 ms
at.ac.testing.brooklyn.equivalent.AutoScalerPolicyTest
setUpSolver 49228 ms
setUp 49228 ms
testConcurrentGrowGrow 49236 ms
tearDown 51139 ms
setUp 51193 ms
testConcurrentGrowShrink 51200 ms
tearDown 53114 ms
setUp 53154 ms
testConcurrentShrinkGrow 53161 ms
tearDown 55122 ms
setUp 55159 ms
testConcurrentShrinkShrink 55166 ms
tearDown 57063 ms
setUp 57101 ms
testGrowHotPool 57108 ms
tearDown 57669 ms
setUp 57701 ms
testNeverGrowAboveMaximmum 57710 ms
tearDown 58278 ms
setUp 58309 ms
testNeverGrowColdPool 58316 ms
tearDown 59135 ms
setUp 59170 ms
testNeverShrinkBelowMinimum 59177 ms
tearDown 59780 ms
setUp 59818 ms
testNeverShrinkHotPool 59825 ms
tearDown 60665 ms
setUp 60704 ms
testResizeDownStabilizationDelayIgnoresBlip 60711 ms
tearDown 63447 ms
setUp 63490 ms
testResizeDownStabilizationDelayResizesAfterDelay 63498 ms
tearDown 65131 ms
setUp 65171 ms
testResizeDownStabilizationDelayTakesMinSustainedDesired 65178 ms
tearDown 77481 ms
setUp 77542 ms
testResizeUpStabilizationDelayIgnoresBlip 77549 ms
tearDown 80201 ms
setUp 80238 ms
testResizeUpStabilizationDelayResizesAfterDelay 80246 ms
tearDown 81845 ms
setUp 81899 ms
testResizeUpStabilizationDelayTakesMaxSustainedDesired 81909 ms
tearDown 84785 ms
setUp 84821 ms
testShrinkColdPool 84828 ms
tearDown 85421 ms
setUp 85459 ms
testShrinkColdPoolRoundsUpDesiredNumberOfContainers 85468 ms
tearDown 86071 ms
at.ac.testing.brooklyn.equivalent.AutoScalerPolicyMetricTest
setUpSolver 86108 ms
before 86108 ms
testDecrementsSizeIffLowerBoundExceeded 86114 ms
tearDown 87496 ms
before 87529 ms
testDecrementsSizeInProportionToMetric 87535 ms
tearDown 89245 ms
before 89281 ms
testIncrementsSizeIffUpperBoundExceeded 89286 ms
tearDown 90694 ms
before 90730 ms
testIncrementsSizeInProportionToMetric 90737 ms
tearDown 91854 ms
before 91894 ms
testObeysMinAndMaxSize 91900 ms
tearDown 93031 ms
before 93070 ms
testWarnsWhenMaxCapReached 93077 ms
tearDown 95218 ms
at.ac.testing.brooklyn.scenario.AutoScalerPolicyTest
setUpSolver 95277 ms
setUp 95277 ms
testConcurrentGrowGrow 95285 ms
forceGC 125324 ms
tearDown 125401 ms
setUp 125443 ms
testConcurrentGrowShrink 125452 ms
forceGC 156055 ms
tearDown 156093 ms
setUp 156132 ms
testConcurrentShrinkGrow 156141 ms
forceGC 187124 ms
tearDown 187162 ms
setUp 187202 ms
testConcurrentShrinkShrink 187211 ms
forceGC 216259 ms
tearDown 216296 ms
setUp 216334 ms
testGrowHotPool 216341 ms
forceGC 225476 ms
tearDown 225514 ms
setUp 225554 ms
testNeverGrowAboveMaximmum 225568 ms
forceGC 234665 ms
tearDown 234699 ms
setUp 234736 ms
testNeverGrowColdPool 234744 ms
forceGC 243769 ms
tearDown 243810 ms
setUp 243846 ms
testNeverShrinkBelowMinimum 243855 ms
forceGC 253453 ms
tearDown 253489 ms
setUp 253527 ms
testNeverShrinkHotPool 253537 ms
forceGC 262696 ms
tearDown 262734 ms
setUp 262773 ms
testResizeDownStabilizationDelayIgnoresBlip 262783 ms
forceGC 288563 ms
tearDown 288604 ms
setUp 288641 ms
testResizeDownStabilizationDelayResizesAfterDelay 288649 ms
forceGC 310949 ms
tearDown 310985 ms
setUp 311022 ms
testResizeDownStabilizationDelayTakesMinSustainedDesired 311031 ms
forceGC 364985 ms
tearDown 365020 ms
setUp 365058 ms
testResizeUpStabilizationDelayIgnoresBlip 365067 ms
forceGC 392461 ms
tearDown 392494 ms
setUp 392535 ms
testResizeUpStabilizationDelayResizesAfterDelay 392543 ms
forceGC 414391 ms
tearDown 414437 ms
setUp 414473 ms
testResizeUpStabilizationDelayTakesMaxSustainedDesired 414481 ms
forceGC 458468 ms
tearDown 458526 ms
setUp 458569 ms
testShrinkColdPool 458576 ms
forceGC 467666 ms
tearDown 467704 ms
setUp 467740 ms
testShrinkColdPoolRoundsUpDesiredNumberOfContainers 467749 ms
forceGC 476864 ms
tearDown 476900 ms
at.ac.testing.brooklyn.scenario.AutoScalerPolicyMetricTest
setUpSolver 476936 ms
before 476936 ms
testDecrementsSizeIffLowerBoundExceeded 476941 ms
tearDown 498826 ms
before 498886 ms
testDecrementsSizeInProportionToMetric 498891 ms
tearDown 535963 ms
before 536020 ms
testIncrementsSizeIffUpperBoundExceeded 536025 ms
tearDown 558337 ms
before 558374 ms
testIncrementsSizeInProportionToMetric 558379 ms
tearDown 581633 ms
before 581678 ms
testObeysMinAndMaxSize 581682 ms
tearDown 603709 ms
before 603751 ms
testWarnsWhenMaxCapReached 603756 ms
tearDown 626582 ms
at.ac.testing.brooklyn.mixed.AutoScalerPolicyTest
setUpSolver 626631 ms
setUp 626631 ms
testConcurrentGrowGrow 626637 ms
forceGC 654993 ms
tearDown 655050 ms
setUp 655096 ms
testConcurrentGrowShrink 655103 ms
forceGC 684383 ms
tearDown 684422 ms
setUp 684458 ms
testConcurrentShrinkGrow 684465 ms
forceGC 712867 ms
tearDown 712903 ms
setUp 712943 ms
testConcurrentShrinkShrink 712951 ms
forceGC 742004 ms
tearDown 742041 ms
setUp 742081 ms
testGrowHotPool 742087 ms
forceGC 742668 ms
tearDown 742700 ms
setUp 742737 ms
testNeverGrowAboveMaximmum 742745 ms
forceGC 752011 ms
tearDown 752051 ms
setUp 752090 ms
testNeverGrowColdPool 752098 ms
forceGC 752960 ms
tearDown 752994 ms
setUp 753037 ms
testNeverShrinkBelowMinimum 753044 ms
forceGC 762899 ms
tearDown 762934 ms
setUp 762968 ms
testNeverShrinkHotPool 762976 ms
forceGC 763823 ms
tearDown 763857 ms
setUp 763896 ms
testResizeDownStabilizationDelayIgnoresBlip 763905 ms
forceGC 789638 ms
tearDown 789677 ms
setUp 789735 ms
testResizeDownStabilizationDelayResizesAfterDelay 789744 ms
forceGC 791333 ms
tearDown 791368 ms
setUp 791409 ms
testResizeDownStabilizationDelayTakesMinSustainedDesired 791417 ms
forceGC 845755 ms
tearDown 845793 ms
setUp 845833 ms
testResizeUpStabilizationDelayIgnoresBlip 845841 ms
forceGC 872653 ms
tearDown 872688 ms
setUp 872726 ms
testResizeUpStabilizationDelayResizesAfterDelay 872735 ms
forceGC 874358 ms
tearDown 874394 ms
setUp 874437 ms
testResizeUpStabilizationDelayTakesMaxSustainedDesired 874444 ms
forceGC 918832 ms
tearDown 918867 ms
setUp 918908 ms
testShrinkColdPool 918914 ms
forceGC 919496 ms
tearDown 919529 ms
setUp 919569 ms
testShrinkColdPoolRoundsUpDesiredNumberOfContainers 919578 ms
forceGC 920169 ms
tearDown 920202 ms
at.ac.testing.brooklyn.mixed.AutoScalerPolicyMetricTest
setUpSolver 920242 ms
before 920243 ms
testDecrementsSizeIffLowerBoundExceeded 920248 ms
tearDown 921654 ms
before 921691 ms
testDecrementsSizeInProportionToMetric 921695 ms
tearDown 923378 ms
before 923413 ms
testIncrementsSizeIffUpperBoundExceeded 923418 ms
tearDown 924818 ms
before 924855 ms
testIncrementsSizeInProportionToMetric 924860 ms
tearDown 925985 ms
before 926026 ms
testObeysMinAndMaxSize 926032 ms
tearDown 948351 ms
before 948393 ms
testWarnsWhenMaxCapReached 948398 ms
tearDown 971277 ms